1 2 Previous Next 19 Replies Latest reply: Feb 16, 2013 7:18 AM by EdStevens Go to original post RSS
      • 15. Re: 11.2.2
        Srini Chavali-Oracle
        What does "not work" mean ? What error messages or codes did you get ?

        HTH
        Srini
        • 16. Re: 11.2.2
          864103
          [oracle@TCCBS bin]$ ./sqlplus / as sysdba
          ./sqlplus: error while loading shared libraries: libsqlplus.so: cannot open shared object file: No such file or directory
          [oracle@TCCBS bin]$
          • 17. Re: 11.2.2
            Srini Chavali-Oracle
            Did the relink command complete successfully without errors ? Do you have all needed RPMs installed on this server ?

            Srini
            • 18. Re: 11.2.2
              864103
              no the relink as the below :
               ./relink all
              writing relink log to: /u01/app/oracle/product/11.2.0/install/relink.log
              
              Building client shared library libclntsh.so ...
              Call script /u01/app/oracle/product/11.2.0/bin/genclntsh ...
              /u01/app/oracle/product/11.2.0/bin/genclntsh
              /u01/app/oracle/product/11.2.0/bin/genclntsh: line 305: gcc: command not found
              genclntsh: Failed to link libclntsh.so.11.1
              make: *** [/u01/app/oracle/product/11.2.0/lib/libclntsh.so] Error 127
              Error in invoking target 'clientonlyinstall' of makefile '/u01/app/oracle/product/11.2.0/ldap/lib/ins_ldap.mk'. See '/u01/app/oracle/product/11.2.0/install/relinkActions2013-02-15_10-26-54-PM.log' for details.
              /u01/app/oracle/product/11.2.0/srvm/lib/ins_srvm.mk:68: warning: overriding commands for target `libsrvm11.so'
              /u01/app/oracle/product/11.2.0/srvm/lib/ins_srvm.mk:31: warning: ignoring old commands for target `libsrvm11.so'
              /u01/app/oracle/product/11.2.0/srvm/lib/ins_srvm.mk:71: warning: overriding commands for target `libsrvmocr11.so'
              /u01/app/oracle/product/11.2.0/srvm/lib/ins_srvm.mk:34: warning: ignoring old commands for target `libsrvmocr11.so'
              /u01/app/oracle/product/11.2.0/srvm/lib/ins_srvm.mk:74: warning: overriding commands for target `libsrvmhas11.so'
              /u01/app/oracle/product/11.2.0/srvm/lib/ins_srvm.mk:37: warning: ignoring old commands for target `libsrvmhas11.so'
              
               - Linking Oracle GETCRSHOME tool
              gcc -o getcrshome -m64 -L/u01/app/oracle/product/11.2.0//lib/ -L/u01/app/oracle/product/11.2.0/lib/ -L/u01/app/oracle/product/11.2.0/lib/stubs/  -L/u01/app/oracle/product/11.2.0/rdbms/lib/   /u01/app/oracle/product/11.2.0/srvm/lib/prgcrshm.o /u01/app/oracle/product/11.2.0/srvm/lib/sprgcrshm.o -locr11 -locrb11 -locrutl11 -lhasgen11 -lclntsh -lsnls11 -lnls11  -lcore11 -lsnls11 -lnls11 -lcore11 -lsnls11 -lnls11 -lxml11 -lcore11 -lunls11 -lsnls11 -lnls11 -lcore11 -lnls11 -lskgxn2  -lclntsh -lsnls11 -lnls11  -lcore11 -lsnls11 -lnls11 -lcore11 -lsnls11 -lnls11 -lxml11 -lcore11 -lunls11 -lsnls11 -lnls11 -lcore11 -lnls11 `cat /u01/app/oracle/product/11.2.0/lib/sysliblist` -lasmclntsh11 -lcell11 -lskgxp11 -lclntsh   `cat /u01/app/oracle/product/11.2.0/lib/sysliblist` -Wl,-rpath,/u01/app/oracle/product/11.2.0/lib -lm    `cat /u01/app/oracle/product/11.2.0/lib/sysliblist` -lm -lm   -L/u01/app/oracle/product/11.2.0/lib
              /bin/sh: gcc: command not found
              make: *** [getcrshome] Error 127
              Error in invoking target 'install' of makefile '/u01/app/oracle/product/11.2.0/srvm/lib/ins_srvm.mk'. See '/u01/app/oracle/product/11.2.0/install/relinkActions2013-02-15_10-26-54-PM.log' for details.
              
               - Linking Import utility (imp)
              rm -f /u01/app/oracle/product/11.2.0/rdbms/lib/imp
              gcc -o /u01/app/oracle/product/11.2.0/rdbms/lib/imp -m64 -L/u01/app/oracle/product/11.2.0/rdbms/lib/ -L/u01/app/oracle/product/11.2.0/lib/ -L/u01/app/oracle/product/11.2.0/lib/stubs/   /u01/app/oracle/product/11.2.0/rdbms/lib/s0impdrv.o  -ldbtools11 -lclntsh  `cat /u01/app/oracle/product/11.2.0/lib/ldflags`    -lncrypt11 -lnsgr11 -lnzjs11 -ln11 -lnl11 -lnro11 `cat /u01/app/oracle/product/11.2.0/lib/ldflags`    -lncrypt11 -lnsgr11 -lnzjs11 -ln11 -lnl11 -lnnz11 -lzt11 -lztkg11 -lztkg11 -lclient11 -lnnetd11  -lvsn11 -lcommon11 -lgeneric11 -lmm -lsnls11 -lnls11  -lcore11 -lsnls11 -lnls11 -lcore11 -lsnls11 -lnls11 -lxml11 -lcore11 -lunls11 -lsnls11 -lnls11 -lcore11 -lnls11 `cat /u01/app/oracle/product/11.2.0/lib/ldflags`    -lncrypt11 -lnsgr11 -lnzjs11 -ln11 -lnl11 -lnro11 `cat /u01/app/oracle/product/11.2.0/lib/ldflags`    -lncrypt11 -lnsgr11 -lnzjs11 -ln11 -lnl11 -lclient11 -lnnetd11  -lvsn11 -lcommon11 -lgeneric11   -lsnls11 -lnls11  -lcore11 -lsnls11 -lnls11 -lcore11 -lsnls11 -lnls11 -lxml11 -lcore11 -lunls11 -lsnls11 -lnls11 -lcore11 -lnls11 -lclient11 -lnnetd11  -lvsn11 -lcommon11 -lgeneric11 -lsnls11 -lnls11  -lcore11 -lsnls11 -lnls11 -lcore11 -lsnls11 -lnls11 -lxml11 -lcore11 -lunls11 -lsnls11 -lnls11 -lcore11 -lnls11   `cat /u01/app/oracle/product/11.2.0/lib/sysliblist` -Wl,-rpath,/u01/app/oracle/product/11.2.0/lib -lm    `cat /u01/app/oracle/product/11.2.0/lib/sysliblist` -ldl -lm   -L/u01/app/oracle/product/11.2.0/lib
              /bin/sh: gcc: command not found
              make: *** [/u01/app/oracle/product/11.2.0/rdbms/lib/imp] Error 127
              Error in invoking target 'utilities' of makefile '/u01/app/oracle/product/11.2.0/rdbms/lib/ins_rdbms.mk'. See '/u01/app/oracle/product/11.2.0/install/relinkActions2013-02-15_10-26-54-PM.log' for details.
              /bin/chmod 755 /u01/app/oracle/product/11.2.0/bin/
               - Linking tnslsnr
              rm -f tnslsnr
              gcc -o tnslsnr -m64 -L/u01/app/oracle/product/11.2.0/network/lib/ -L/u01/app/oracle/product/11.2.0/lib/ -L/u01/app/oracle/product/11.2.0/lib/stubs/  /u01/app/oracle/product/11.2.0/network/lib/s0nsgl.o /u01/app/oracle/product/11.2.0/network/lib/snsglp.o -lclntsh  `cat /u01/app/oracle/product/11.2.0/lib/ldflags`    -lncrypt11 -lnsgr11 -lnzjs11 -ln11 -lnl11 -lnro11 `cat /u01/app/oracle/product/11.2.0/lib/ldflags`    -lncrypt11 -lnsgr11 -lnzjs11 -ln11 -lnl11 -lnnz11 -lzt11 -lztkg11 -lztkg11 -lclient11 -lnnetd11  -lvsn11 -lcommon11 -lgeneric11 -lmm -lsnls11 -lnls11  -lcore11 -lsnls11 -lnls11 -lcore11 -lsnls11 -lnls11 -lxml11 -lcore11 -lunls11 -lsnls11 -lnls11 -lcore11 -lnls11 `cat /u01/app/oracle/product/11.2.0/lib/ldflags`    -lncrypt11 -lnsgr11 -lnzjs11 -ln11 -lnl11 -lnro11 `cat /u01/app/oracle/product/11.2.0/lib/ldflags`    -lncrypt11 -lnsgr11 -lnzjs11 -ln11 -lnl11 -lclient11 -lnnetd11  -lvsn11 -lcommon11 -lgeneric11   -lsnls11 -lnls11  -lcore11 -lsnls11 -lnls11 -lcore11 -lsnls11 -lnls11 -lxml11 -lcore11 -lunls11 -lsnls11 -lnls11 -lcore11 -lnls11 -lclient11 -lnnetd11  -lvsn11 -lcommon11 -lgeneric11 -lsnls11 -lnls11  -lcore11 -lsnls11 -lnls11 -lcore11 -lsnls11 -lnls11 -lxml11 -lcore11 -lunls11 -lsnls11 -lnls11 -lcore11 -lnls11   `cat /u01/app/oracle/product/11.2.0/lib/sysliblist` -Wl,-rpath,/u01/app/oracle/product/11.2.0/lib -lm    `cat /u01/app/oracle/product/11.2.0/lib/sysliblist` -ldl -lm   -L/u01/app/oracle/product/11.2.0/lib -lons -lnl11  -ln11 -lnlsnr11 -lnlsnrc11 -lnsgr11 -lnms -lncm11 -lnmsp -lpeer -lnro11 -ln11   -lnl11 -lnlsnr11 -lnlsnrc11 -lnms -lncm11 -lnmsp -ln11     -lm
              /bin/sh: gcc: command not found
              make: *** [tnslsnr] Error 127
              Error in invoking target 'install' of makefile '/u01/app/oracle/product/11.2.0/network/lib/ins_net_server.mk'. See '/u01/app/oracle/product/11.2.0/install/relinkActions2013-02-15_10-26-54-PM.log' for details.
               - Linking trcroute
              rm -f trcroute
              gcc -o trcroute -m64 -L/u01/app/oracle/product/11.2.0/network/lib/ -L/u01/app/oracle/product/11.2.0/lib/ -L/u01/app/oracle/product/11.2.0/lib/stubs/  /u01/app/oracle/product/11.2.0/network/lib/s0nur.o /u01/app/oracle/product/11.2.0/network/lib/nur.o -lclntsh  `cat /u01/app/oracle/product/11.2.0/lib/ldflags`    -lncrypt11 -lnsgr11 -lnzjs11 -ln11 -lnl11 -lnro11 `cat /u01/app/oracle/product/11.2.0/lib/ldflags`    -lncrypt11 -lnsgr11 -lnzjs11 -ln11 -lnl11 -lnnz11 -lzt11 -lztkg11 -lztkg11 -lclient11 -lnnetd11  -lvsn11 -lcommon11 -lgeneric11 -lmm -lsnls11 -lnls11  -lcore11 -lsnls11 -lnls11 -lcore11 -lsnls11 -lnls11 -lxml11 -lcore11 -lunls11 -lsnls11 -lnls11 -lcore11 -lnls11 `cat /u01/app/oracle/product/11.2.0/lib/ldflags`    -lncrypt11 -lnsgr11 -lnzjs11 -ln11 -lnl11 -lnro11 `cat /u01/app/oracle/product/11.2.0/lib/ldflags`    -lncrypt11 -lnsgr11 -lnzjs11 -ln11 -lnl11 -lclient11 -lnnetd11  -lvsn11 -lcommon11 -lgeneric11   -lsnls11 -lnls11  -lcore11 -lsnls11 -lnls11 -lcore11 -lsnls11 -lnls11 -lxml11 -lcore11 -lunls11 -lsnls11 -lnls11 -lcore11 -lnls11 -lclient11 -lnnetd11  -lvsn11 -lcommon11 -lgeneric11 -lsnls11 -lnls11  -lcore11 -lsnls11 -lnls11 -lcore11 -lsnls11 -lnls11 -lxml11 -lcore11 -lunls11 -lsnls11 -lnls11 -lcore11 -lnls11   `cat /u01/app/oracle/product/11.2.0/lib/sysliblist` -Wl,-rpath,/u01/app/oracle/product/11.2.0/lib -lm    `cat /u01/app/oracle/product/11.2.0/lib/sysliblist` -ldl -lm   -L/u01/app/oracle/product/11.2.0/lib
              /bin/sh: gcc: command not found
              make: *** [trcroute] Error 127
              Error in invoking target 'itrcroute' of makefile '/u01/app/oracle/product/11.2.0/network/lib/ins_net_client.mk'. See '/u01/app/oracle/product/11.2.0/install/relinkActions2013-02-15_10-26-54-PM.log' for details.
              
               - Linking recovery manager (rman)
              rm -f /u01/app/oracle/product/11.2.0/rdbms/lib/rman
              gcc -o /u01/app/oracle/product/11.2.0/rdbms/lib/rman -m64 -L/u01/app/oracle/product/11.2.0/rdbms/lib/ -L/u01/app/oracle/product/11.2.0/lib/ -L/u01/app/oracle/product/11.2.0/lib/stubs/   /u01/app/oracle/product/11.2.0/lib/s0main.o /u01/app/oracle/product/11.2.0/rdbms/lib/sskrmed.o /u01/app/oracle/product/11.2.0/rdbms/lib/skrmpt.o -ldbtools11 -lclient11 -lsql11 -lpls11  -lrt -lplp11 -lsnls11 -lunls11 -lnls11 -lslax11 -lpls11  -lrt -lplp11 /u01/app/oracle/product/11.2.0/lib/libplc11.a -lclntsh  `cat /u01/app/oracle/product/11.2.0/lib/ldflags`    -lncrypt11 -lnsgr11 -lnzjs11 -ln11 -lnl11 -lnro11 `cat /u01/app/oracle/product/11.2.0/lib/ldflags`    -lncrypt11 -lnsgr11 -lnzjs11 -ln11 -lnl11 -lnnz11 -lzt11 -lztkg11 -lztkg11 -lclient11 -lnnetd11  -lvsn11 -lcommon11 -lgeneric11 -lmm -lsnls11 -lnls11  -lcore11 -lsnls11 -lnls11 -lcore11 -lsnls11 -lnls11 -lxml11 -lcore11 -lunls11 -lsnls11 -lnls11 -lcore11 -lnls11 `cat /u01/app/oracle/product/11.2.0/lib/ldflags`    -lncrypt11 -lnsgr11 -lnzjs11 -ln11 -lnl11 -lnro11 `cat /u01/app/oracle/product/11.2.0/lib/ldflags`    -lncrypt11 -lnsgr11 -lnzjs11 -ln11 -lnl11 -lclient11 -lnnetd11  -lvsn11 -lcommon11 -lgeneric11   -lsnls11 -lnls11  -lcore11 -lsnls11 -lnls11 -lcore11 -lsnls11 -lnls11 -lxml11 -lcore11 -lunls11 -lsnls11 -lnls11 -lcore11 -lnls11 -lclient11 -lnnetd11  -lvsn11 -lcommon11 -lgeneric11 -lsnls11 -lnls11  -lcore11 -lsnls11 -lnls11 -lcore11 -lsnls11 -lnls11 -lxml11 -lcore11 -lunls11 -lsnls11 -lnls11 -lcore11 -lnls11   `cat /u01/app/oracle/product/11.2.0/lib/sysliblist` -Wl,-rpath,/u01/app/oracle/product/11.2.0/lib -lm    `cat /u01/app/oracle/product/11.2.0/lib/sysliblist` -ldl -lm   -L/u01/app/oracle/product/11.2.0/lib
              /bin/sh: gcc: command not found
              make: *** [/u01/app/oracle/product/11.2.0/rdbms/lib/rman] Error 127
              Error in invoking target 'irman ioracle' of makefile '/u01/app/oracle/product/11.2.0/rdbms/lib/ins_rdbms.mk'. See '/u01/app/oracle/product/11.2.0/install/relinkActions2013-02-15_10-26-54-PM.log' for details.
              [oracle@TCCBS bin]$
              the package i can't install any package due to my o.s not register in ULN
              yum install gcc
              .
              .
              .
              
               You could try using --skip-broken to work around the problem
               You could try running: package-cleanup --problems
                                      package-cleanup --dupes
                                      rpm -Va --nofiles --nodigest
              The program package-cleanup is found in the yum-utils package.
              thanks
              • 19. Re: 11.2.2
                EdStevens
                861100 wrote:
                no the relink as the below :



                the package i can't install any package due to my o.s not register in ULN
                As I said before, none of my machines are registered with ULN and I have no problems at all. And gcc is the very first package I install after creating a new server.
                yum install gcc
                .
                .
                .
                So why are you redacting the output --- especially any error messages????
                >
                You could try using --skip-broken to work around the problem
                You could try running: package-cleanup --problems
                package-cleanup --dupes
                rpm -Va nofiles nodigest
                The program package-cleanup is found in the yum-utils package.
                thanks
                Edited by: EdStevens on Feb 16, 2013 7:17 AM
                1 2 Previous Next