14 Replies Latest reply: Mar 12, 2008 3:06 PM by 624574 RSS

    During oracle 10gR2 installation error 'invoking target 'collector'of make

    610099
      During 65%of the installation of oracle 10gR2 on SuSE 10.3 of X86-64 machine the following error was occurred:
      error invoking target 'collector' of make file '/u01/app/oracle/product/10.2.0/db_1/sysman/lib_emdb.mk'. see the oraInventory log details.

      Hi friends can u help me????
        • 1. Re: During oracle 10gR2 installation error 'invoking target 'collector'of m
          Ivan Kartik
          1. Did you install all required packages listed in installation prerequisites (in Install guide)?
          2. Can you post here last 15 lines from $ORACLE_HOME/install/make.log file?
          • 2. Re: During oracle 10gR2 installation error 'invoking target 'collector'of m
            610099
            # cd $ORACLE_BASE
            # cd product/10.2.0/db_1/install
            # vi make.log
            ( last 15 lines )
            - Linking liborasdk
            /u01/app/oracle/product/10.2.0/db_1/bin/genorasdksh
            $Id: genorasdksh.sh 02-mar-2005.16:22:46 mchengjr Exp $
            Generating FULL ORASDK library...
            Creating /u01/app/oracle/product/10.2.0/db_1/lib/liborasdk.so.10.2
            -rwxrwx--- 1 oracle oinstall 16979278 2007-12-03 17:34 liborasdk.so.10.2
            lrwxrwxrwx 1 oracle oinstall 17 2007-12-03 17:34 liborasdk.so -> liborasdk.so.10.2
            /usr/bin/make -f ins_rdbms.mk ipc_udp/rm -f /u01/app/oracle/product/10.2.0/db_1/lib/libskgxp10.so
            cp /u01/app/oracle/product/10.2.0/db_1/lib//libskgxpu.so /u01/app/oracle/product/10.2.0/db_1/lib/libskgxp10.so
            /usr/bin/make -f ins_emdb.mk collector ORACLE_HOME=/u01/app/oracle/product/10.2.0/db_1/make -f /u01/app/oracle/product/10.2.0/db_1/sysman/lib/ins_emdb.mk relink_exe EXENAME=nmccollector
            make[1]: Entering directory `/u01/app/oracle/product/10.2.0/db_1/sysman/lib'
            gcc -o /u01/app/oracle/product/10.2.0/db_1/sysman/lib/nmccollector -L/u01/app/oracle/product/10.2.0/db_1/lib/ -L/u01/app/oracle/product/10.2.0/db_1/sysman/lib/ `cat /u01/app/oracle/product/10.2.0/db_1/lib/sysliblist` -Wl,-rpath,/u01/app/oracle/product/10.2.0/db_1/lib -lm `cat /u01/app/oracle/product/10.2.0/db_1/lib/sysliblist` -ldl -lm -L/u01/app/oracle/product/10.2.0/db_1/lib -Wl,-export-dynamic /u01/app/oracle/product/10.2.0/db_1/sysman/lib/snmccolm.o /u01/app/oracle/product/10.2.0/db_1/sysman/lib/libnmccol.a /u01/app/oracle/product/10.2.0/db_1/sysman/lib/libnmcbuf.a /u01/app/oracle/product/10.2.0/db_1/sysman/lib//libnmadbg.a /u01/app/oracle/product/10.2.0/db_1/rdbms/lib/libdsga10.a /u01/app/oracle/product/10.2.0/db_1/lib/libserver10.a /u01/app/oracle/product/10.2.0/db_1/lib/libclntsh.so `cat /u01/app/oracle/product/10.2.0/db_1/lib/sysliblist` -ldl -lm
            /usr/lib64/gcc/x86_64-suse-linux/4.2.1/../../../../x86_64-suse-linux/bin/ld: i386 architecture of input file `/u01/app/oracle/product/10.2.0/db_1/sysman/lib/snmccolm.o' is incompatible with i386:x86-64 output
            /usr/lib64/gcc/x86_64-suse-linux/4.2.1/../../../../x86_64-suse-linux/bin/ld: i386 architecture of input file `/u01/app/oracle/product/10.2.0/db_1/sysman/lib/libnmccol.a(nmccole.o)' is incompatible with i386:x86-64 output
            /usr/lib64/gcc/x86_64-suse-linux/4.2.1/../../../../x86_64-suse-linux/bin/ld: i386 architecture of input file `/u01/app/oracle/product/10.2.0/db_1/sysman/lib/libnmcbuf.a(nmcbuft.o)' is incompatible with i386:x86-64 output
            /usr/lib64/gcc/x86_64-suse-linux/4.2.1make[1]: Leaving directory `/u01/app/oracle/product/10.2.0/db_1/sysman/lib'
            /../../../../x86_64-suse-linux/bin/ld: i386 architecture of input file `/u01/app/oracle/product/10.2.0/db_1/sysman/lib/libnmcbuf.a(nmcbufw.o)' is incompatible with i386:x86-64 output
            /usr/lib64/gcc/x86_64-suse-linux/4.2.1/../../../../x86_64-suse-linux/bin/ld: i386 architecture of input file `/u01/app/oracle/product/10.2.0/db_1/sysman/lib/libnmcbuf.a(nmcbufu.o)' is incompatible with i386:x86-64 output
            /usr/lib64/gcc/x86_64-suse-linux/4.2.1/../../../../x86_64-suse-linux/bin/ld: i386 architecture of input file `/u01/app/oracle/product/10.2.0/db_1/sysman/lib/libnmcbuf.a(snmcbufm.o)' is incompatible with i386:x86-64 output
            /usr/lib64/gcc/x86_64-suse-linux/4.2.1/../../../../x86_64-suse-linux/bin/ld: i386 architecture of input file `/u01/app/oracle/product/10.2.0/db_1/sysman/lib/libnmcbuf.a(nmcbuff.o)' is incompatible with i386:x86-64 output
            /usr/lib64/gcc/x86_64-suse-linux/4.2.1/../../../../x86_64-suse-linux/bin/ld: i386 architecture of input file `/u01/app/oracle/product/10.2.0/db_1/sysman/lib//libnmadbg.a(nmadbg.o)' is incompatible with i386:x86-64 output
            /usr/lib64/gcc/x86_64-suse-linux/4.2.1/../../../../x86_64-suse-linux/bin/ld: i386 architecture of input file `/u01/app/oracle/product/10.2.0/db_1/sysman/lib//libnmadbg.a(snmadbg.o)' is incompatible with i386:x86-64 output
            collect2: ld returned 1 exit status
            make[1]: *** [u01/app/oracle/product/10.2.0/db_1/sysman/lib/nmccollector] Error 1
            make: *** [nmccollector] Error 2
            • 3. Re: During oracle 10gR2 installation error 'invoking target 'collector'of m
              19426
              If I interpret this correctly you're trying to install 10g 32bit on Linux 64bit OS. Oracle suppports Oracle 32-bit running on AMD64/EM64T with a 32-bit OS, but you need 10g 64bit.

              Werner
              • 4. Re: During oracle 10gR2 installation error 'invoking target 'collector'of m
                610099
                Dear Werner,
                i am sure i.e a 64 bit oracle 10g version. (10201_database_linux_x86_64.cpio). ok.

                Rajesh
                • 5. Re: During oracle 10gR2 installation error 'invoking target 'collector'of m
                  19426
                  That's strange. I'm confused because of these messages:
                  i386 architecture of input file `/u01/app/oracle/product/10.2.0/db_1/sysman/lib/snmccolm.o' is incompatible with i386:x86-64 output

                  Werner
                  • 6. Re: During oracle 10gR2 installation error 'invoking target 'collector'of m
                    610099
                    anybody help me to install this issue.....

                    Thanks in advance
                    • 7. Re: During oracle 10gR2 installation error 'invoking target 'collector'of m
                      Ivan Kartik
                      That's strange. I'm confused because of these messages:
                      i386 architecture of input file `/u01/app/oracle/product/10.2.0/db_1/sysman/lib/snmccolm.o' is incompatible with i386:x86-64 output
                      I'm asking again: Did you install all required packages listed in installation prerequisites (in Install guide)?

                      For resolution post further details (output from these commands):
                      uname -mpi
                      rpm -qa --qf '%{name}-%{version}-%{release}.%{arch}\n'|egrep 'compat|glibc|gcc|libstdc'|sort
                      • 8. Re: During oracle 10gR2 installation error 'invoking target 'collector'of m
                        610099
                        thomson:~ # uname -mpi
                        x86_64 x86_64 x86_64
                        thomson:~ # rpm -qa --qf '%{name}-%{version}-%{release}.%{arch}\n'|egrep 'compat
                        |glibc|gcc|libstdc'|sort
                        avahi-compat-mDNSResponder-0.6.20-40.x86_64
                        avahi-compat-mDNSResponder-32bit-0.6.20-40.x86_64
                        avahi-compat-mDNSResponder-devel-0.6.20-40.x86_64
                        cdrkit-cdrtools-compat-1.1.6-22.x86_64
                        compat-libstdc++-5.0.7-86.x86_64
                        compat-openssl097g-0.9.7g-75.x86_64
                        gcc-32bit-4.2-24.x86_64
                        gcc-4.2-24.x86_64
                        gcc42-32bit-4.2.1_20070724-17.x86_64
                        gcc42-4.2.1_20070724-17.x86_64
                        gcc42-c++-4.2.1_20070724-17.x86_64
                        gcc42-fortran-4.2.1_20070724-17.x86_64
                        gcc42-gij-4.2.1_20070724-26.x86_64
                        gcc42-info-4.2.1_20070724-17.x86_64
                        gcc42-java-4.2.1_20070724-17.x86_64
                        gcc-c++-4.2-24.x86_64
                        gcc-fortran-4.2-24.x86_64
                        gcc-gij-4.2-24.x86_64
                        gcc-info-4.2-24.x86_64
                        gcc-java-4.2-24.x86_64
                        glibc-2.6.1-18.x86_64
                        glibc-32bit-2.6.1-18.x86_64
                        glibc-devel-2.6.1-18.x86_64
                        glibc-devel-32bit-2.6.1-18.x86_64
                        glibc-i18ndata-2.6.1-18.x86_64
                        glibc-info-2.6.1-18.x86_64
                        glibc-locale-2.6.1-18.x86_64
                        glibc-locale-32bit-2.6.1-18.x86_64
                        java-1_4_2-gcj-compat-1.4.2.0-177.x86_64
                        java-1_4_2-gcj-compat-devel-1.4.2.0-177.x86_64
                        libgcc42-32bit-4.2.1_20070724-17.x86_64
                        libgcc42-4.2.1_20070724-17.x86_64
                        libstdc++42-32bit-4.2.1_20070724-17.x86_64
                        libstdc++42-4.2.1_20070724-17.x86_64
                        libstdc++42-devel-32bit-4.2.1_20070724-17.x86_64
                        libstdc++42-devel-4.2.1_20070724-17.x86_64
                        libstdc++-devel-4.2-24.x86_64
                        • 9. Re: During oracle 10gR2 installation error 'invoking target 'collector'of m
                          610099
                          plz. help me if anyone have idea.. i am strucking with this issue for long....

                          S. Rajesh
                          • 10. Re: During oracle 10gR2 installation error 'invoking target 'collector'of m
                            610099
                            For a long time i am struggling with this issue..........plz. help me if anyone knows the solution..

                            Rajesh. S
                            • 11. Re: During oracle 10gR2 installation error 'invoking target 'collector'of m
                              619495
                              I'm wondering if someone ever solved this annoying problem. I had the same issue right now and Metalink does not say anything about it.
                              • 12. Re: During oracle 10gR2 installation error 'invoking target 'collector'of m
                                Ivan Kartik
                                Yes, try to look here: http://ivan.kartik.sk/oracle/install_ora11gR1_suse.html
                                Yes I know this paper describes 11g installation but the packages and workarounds are the same for 10g (tested). OpenSuSE 10.3 specific steps are marked as "for OpenSuSE ...".
                                • 13. Re: During oracle 10gR2 installation error 'invoking target 'collector'of m
                                  624574
                                  Hi Ivan,

                                  i did everything you discribed under "http://ivan.kartik.sk/oracle/install_ora11gR1_suse.html", but i got same failure like S.Rajesh:

                                  rklh:~ # tail /opt/oracle/app/oracle/myOra/install/make.log
                                  - Linking liborasdk
                                  /opt/oracle/app/oracle/myOra/bin/genorasdksh
                                  $Id: genorasdksh.sh 02-mar-2005.16:22:46 mchengjr Exp $
                                  Generating FULL ORASDK library...
                                  Creating /opt/oracle/app/oracle/myOra/lib/liborasdk.so.10.2
                                  -rwxrwx--- 1 oracle oinstall 16979278 22. Feb 00:46 liborasdk.so.10.2
                                  lrwxrwxrwx 1 oracle oinstall 17 22. Feb 00:46 liborasdk.so -> liborasdk.so.10.2
                                  /usr/bin/make -f ins_rdbms.mk ipc_udp/rm -f /opt/oracle/app/oracle/myOra/lib/libskgxp10.so
                                  cp /opt/oracle/app/oracle/myOra/lib//libskgxpu.so /opt/oracle/app/oracle/myOra/lib/libskgxp10.so
                                  /usr/bin/make -f ins_emdb.mk collector ORACLE_HOME=/opt/oracle/app/oracle/myOra/make -f /opt/oracle/app/oracle/myOra/sysman/lib/ins_emdb.mk relink_exe EXENAME=nmccollector
                                  make[1]: Entering directory `/opt/oracle/app/oracle/myOra/sysman/lib'
                                  gcc -o /opt/oracle/app/oracle/myOra/sysman/lib/nmccollector -L/opt/oracle/app/oracle/myOra/lib/ -L/opt/oracle/app/oracle/myOra/sysman/lib/ `cat /opt/oracle/app/oracle/myOra/lib/sysliblist` -Wl,-rpath
                                  ,/opt/oracle/app/oracle/myOra/lib -lm `cat /opt/oracle/app/oracle/myOra/lib/sysliblist` -ldl -lm -L/opt/oracle/app/oracle/myOra/lib -Wl,-export-dynamic /opt/oracle/app/oracle/myOra/sysman/lib/snmcco
                                  lm.o /opt/oracle/app/oracle/myOra/sysman/lib/libnmccol.a /opt/oracle/app/oracle/myOra/sysman/lib/libnmcbuf.a /opt/oracle/app/oracle/myOra/sysman/lib//libnmadbg.a /opt/oracle/app/oracle/myOra/rdbms/lib/li
                                  bdsga10.a /opt/oracle/app/oracle/myOra/lib/libserver10.a /opt/oracle/app/oracle/myOra/lib/libclntsh.so `cat /opt/oracle/app/oracle/myOra/lib/sysliblist` -ldl -lm
                                  /usr/lib64/gcc/x86_64-suse-linux/4.2.1/../../../../x86_64-suse-linux/bin/ld: i386 architecture of input file `/opt/oracle/app/oracle/myOra/sysman/lib/snmccolm.o' is incompatible with i386:x86-64 output
                                  /usr/lib64/gcc/x86_64-suse-linux/4.2.1/../../../../x86_64-suse-linux/bin/ld: i386 architecture of input file `/opt/oracle/app/oracle/myOra/sysman/lib/libnmccol.a(nmccole.o)' is incompatible with i386:x86-64 output
                                  /usr/lib64/gcc/x86_64-suse-linux/4.2.1/../../../../x86_64-suse-linux/bin/ld: i386 architecture of input file `/opt/oracle/app/oracle/myOra/sysman/lib/libnmcbuf.a(nmcbuft.o)' is incompatible with i386:x86-64 output
                                  /usr/lib64/gcc/x86_64-suse-linux/4.2.1/../../../../x86_64-suse-linux/bin/ld: i386 architecture of input file `/opt/oracle/app/oracle/myOra/sysman/lib/libnmcbuf.a(nmcbufw.o)' is incompatible with i386:x86-64 output
                                  /usr/lib64/gcc/x86_64-suse-linux/4.2.1/../../../../x86_64-suse-linux/bin/ld: i386 architecture of input file `/opt/oracle/app/oracle/myOra/sysman/lib/libnmcbuf.a(nmcbufu.o)' is incompatible with i386:x86-64 output
                                  /usr/lib64/gcc/x86_64-suse-linux/4.2.1/../../../../x86_64-suse-linux/bin/ld: i386 architecture of input file `/opt/oracle/app/oracle/myOra/sysman/lib/libnmcbuf.a(snmcbufm.o)' is incompatible with i386:x86-64 output
                                  /usr/lib64/gcc/x86_64-suse-linux/4.2.1/../../../../x86_64-suse-linux/bin/ld: i386 architecture of input file `/opt/oracle/app/oracle/myOra/sysman/lib/libnmcbuf.a(nmcbuff.o)' is incompatible with i386:x86-64 output
                                  /usr/lib64/gcc/x86_64-suse-linux/4.2.1/../../../../x86_64-suse-linux/bin/ld: i386 architecture of input file `/opt/oracle/app/oracle/myOra/sysman/lib//libnmadbg.a(nmadbg.o)' is incompatible with i386:x86-64 output
                                  /usr/lib64/gcc/x86_64-suse-linux/4.2.1/../../../../x86_64-suse-linux/bin/ld: i386 architecture of input file `/opt/oracle/app/oracle/myOra/sysman/lib//libnmadbg.a(snmadbg.o)' is incompatible with i386:x86-64 output
                                  collect2: ld returned 1 exit status
                                  make[1]: *** [opt/oracle/app/oracle/myOra/sysman/lib/nmccollector] Fehler 1
                                  make[1]: Leaving directory `/opt/oracle/app/oracle/myOra/sysman/lib'
                                  make: *** [nmccollector] Fehler 2

                                  rklh:~ # uname -a
                                  Linux rklh 2.6.22.17-0.1-default #1 SMP 2008/02/10 20:01:04 UTC x86_64 x86_64 x86_64 GNU/Linux

                                  rklh:~ # rpm -qa --qf '%{name}-%{version}-%{release}.%{arch}\n'|egrep 'binutils|compat|glibc|gcc|libstd|cpp|make|ODBC|libaio|ksh|motif|libelf|sysstat'| egrep -v 'avahi|cdrkit|ldap|ssl'|sort
                                  binutils-2.17.50.20070726-14.x86_64
                                  compat-2007.4.18-31.i586
                                  compat-libstdc++-5.0.7-86.x86_64
                                  cpp-4.2-24.x86_64
                                  cpp42-4.2.1_20070724-17.x86_64
                                  gcc-32bit-4.2-24.x86_64
                                  gcc-4.2-24.x86_64
                                  gcc42-32bit-4.2.1_20070724-17.x86_64
                                  gcc42-4.2.1_20070724-17.x86_64
                                  gcc42-c++-4.2.1_20070724-17.x86_64
                                  gcc-c++-4.2-24.x86_64
                                  glibc-2.6.1-18.3.x86_64
                                  glibc-32bit-2.6.1-18.3.x86_64
                                  glibc-devel-2.6.1-18.3.x86_64
                                  glibc-devel-32bit-2.6.1-18.3.x86_64
                                  glibc-i18ndata-2.6.1-18.3.x86_64
                                  glibc-locale-2.6.1-18.3.x86_64
                                  glibc-locale-32bit-2.6.1-18.3.x86_64
                                  ksh-93s-48.2.x86_64
                                  libaio-0.3.104-74.x86_64
                                  libaio-32bit-0.3.104-74.x86_64
                                  libaio-devel-0.3.104-74.x86_64
                                  libaio-devel-32bit-0.3.104-74.x86_64
                                  libelf0-0.8.9-17.x86_64
                                  libgcc42-32bit-4.2.1_20070724-17.x86_64
                                  libgcc42-4.2.1_20070724-17.x86_64
                                  libstdc++42-32bit-4.2.1_20070724-17.x86_64
                                  libstdc++42-4.2.1_20070724-17.x86_64
                                  libstdc++42-devel-32bit-4.2.1_20070724-17.x86_64
                                  libstdc++42-devel-4.2.1_20070724-17.x86_64
                                  make-3.81-66.x86_64
                                  openmotif-libs-2.3.0-23.x86_64
                                  pdksh-5.2.14-863.x86_64
                                  sysstat-7.1.6-16.x86_64
                                  unixODBC-32bit-2.2.12-55.x86_64

                                  rklh:~ # cat /etc/SuSE-release.orig
                                  openSUSE 10.3 (X86-64)
                                  VERSION = 10.3

                                  rklh:~ # file /var/tmp/oracle/10201_database_linux_x86_64.cpio
                                  /var/tmp/oracle/10201_database_linux_x86_64.cpio: ASCII cpio archive (SVR4 with no CRC)
                                  • 14. Re: During oracle 10gR2 installation error 'invoking target 'collector'of m
                                    624574
                                    Hello,

                                    me again. It seems to be a problem with Oracle Enterprise Manager. I deinstalled the old installation and reinstalled it without Oracle Enterprise Manager and everythings looks fine.

                                    Kind reguards
                                    rig