This discussion is archived
5 Replies Latest reply: Aug 23, 2013 7:01 AM by Diego Neri RSS

Metadata import error

781825 Newbie
Currently Being Moderated
Hi ,

I am getting following error while running the ant script "ant -f updatemetaData.xml"

**This Exception occurred at .**
**[exec] oracle.mds.lcm.client.MDSLCMClientException: MDSAppRuntimeMBean is**
**ot available for oracle.mds.lcm:name=MDSAppRuntime,type=MDSAppRuntime,Applicat**
**n=soa-infra,Location=soa_server1,***
**[exec] at oracle.mds.lcm.client.MetadataTransferManager.getAppRuntime**
**eanName(MetadataTransferManager.java:655)**
**[exec] at oracle.mds.lcm.client.MetadataTransferManager.importMetadat**
**MetadataTransferManager.java:524)**
**[exec] at sun.reflect.NativeMethodAccessorImpl.invoke0(Native Method)**
**[exec] at sun.reflect.NativeMethodAccessorImpl.invoke(NativeMethodAcc**
**sorImpl.java:39)**
**[exec] at sun.reflect.DelegatingMethodAccessorImpl.invoke(DelegatingM**
**hodAccessorImpl.java:25)**
**[exec] at java.lang.reflect.Method.invoke(Method.java:597)**
**[exec] at org.python.core.PyReflectedFunction.__call__(Unknown Source**
**[exec] at org.python.core.PyMethod.__call__(Unknown Source)**
**[exec] at org.python.core.PyObject.__call__(Unknown Source)**
**[exec] at org.python.core.PyObject.invoke(Unknown Source)**
**[exec] at org.python.pycode._pyx28.executeMetadataTransferManagerOper**
**ion$31(C:\Oracle\MIDDLE~2\ORACLE~1\common\wlst\mdsWLSTCommands.py:773)**
**[exec] at org.python.pycode._pyx28.call_function(C:\Oracle\MIDDLE~2\O**
**CLE~1\common\wlst\mdsWLSTCommands.py)**
**[exec] at org.python.core.PyTableCode.call(Unknown Source)**
**[exec] at org.python.core.PyTableCode.call(Unknown Source)**
**[exec] at org.python.core.PyFunction.__call__(Unknown Source)**
**[exec] at org.python.core.PyObject.__call__(Unknown Source)**
**[exec] at org.python.pycode._pyx28.importMetadata$5(C:\Oracle\MIDDLE~**
**ORACLE~1\common\wlst\mdsWLSTCommands.py:264)**
**[exec] at org.python.pycode._pyx28.call_function(C:\Oracle\MIDDLE~2\O**
**CLE~1\common\wlst\mdsWLSTCommands.py)**
**[exec] at org.python.core.PyTableCode.call(Unknown Source)**
**[exec] at org.python.core.PyTableCode.call(Unknown Source)**
**[exec] at org.python.core.PyFunction.__call__(Unknown Source)**
**[exec] at org.python.pycode._pyx46.f$0(C:\AIAHOME\Infrastructure\Inst**
**l\AID\lib\py\updateMetadata.py:50)**
**[exec] at org.python.pycode._pyx46.call_function(C:\AIAHOME\Infrastru**
**ure\Install\AID\lib\py\updateMetadata.py)**
**[exec] at org.python.core.PyTableCode.call(Unknown Source)**
**[exec] at org.python.core.PyCode.call(Unknown Source)**
**[exec] at org.python.core.Py.runCode(Unknown Source)**
**[exec] at org.python.util.PythonInterpreter.execfile(Unknown Source)**
**[exec] at weblogic.management.scripting.WLST.main(WLST.java:124)**
**[exec] at sun.reflect.NativeMethodAccessorImpl.invoke0(Native Method)**
**[exec] at sun.reflect.NativeMethodAccessorImpl.invoke(NativeMethodAcc**
**sorImpl.java:39)**
**[exec] at sun.reflect.DelegatingMethodAccessorImpl.invoke(DelegatingM**
**hodAccessorImpl.java:25)**
**[exec] at java.lang.reflect.Method.invoke(Method.java:597)**
**[exec] at weblogic.WLST.main(WLST.java:29)**
**[exec] Problem invoking WLST - Traceback (innermost last):**
**[exec] File "C:\AIAHOME\Infrastructure\Install\AID\lib\py\updateMetadat**
**py", line 53, in ?**
**[exec] at sun.reflect.NativeConstructorAccessorImpl.newInstance0(Nati**
**Method)**
**[exec] at sun.reflect.NativeConstructorAccessorImpl.newInstance(Nativ**
**onstructorAccessorImpl.java:39)**
**[exec] at sun.reflect.DelegatingConstructorAccessorImpl.newInstance(D**
**egatingConstructorAccessorImpl.java:27)**
**[exec] at java.lang.reflect.Constructor.newInstance(Constructor.java:**
**3)**
**[exec]**
**[exec] java.lang.Exception: java.lang.Exception: Error!!! Import MetaData**
**ailed !!**
**[exec]**
**BUILD FAILED**
**c:\AIAHOME\Infrastructure\Install\config\UpdateMetaData.xml:7: The following e**
**or occurred while executing this line:**
**C:\AIAHOME\Infrastructure\Install\AID\AIAExecuteDriver.xml:98: The following e**
**or occurred while executing this line:**
**C:\AIAHOME\Infrastructure\Install\AID\AIAExecuteDriver.xml:59: The following e**
**or occurred while executing this line:**
**C:\AIAHOME\aia_instances\AIA1\tmp\AIDExecuteDP_temp_1402590518.xml:4: The foll**
**ing error occurred while executing this line:**
**C:\AIAHOME\Infrastructure\Install\AID\lib\AIDConfigurationLibraryTasks.xml:800**
**exec returned: 1**
**Total time: 31 seconds**
**c:\AIAHOME\Infrastructure\Install\config>**



plzz help me out this problem..


Thanks
Govindan P

Legend

  • Correct Answers - 10 points
  • Helpful Answers - 5 points