0 Replies Latest reply on Sep 8, 2005 9:58 AM by 807559

    Help to install cyrus-sasl-2.1.21 for Solaris 9

    807559
      Want to install cyrus-sasl-2.1.21... the configure process : Configuration Complete. Type 'make' to build.
      try make and have next log :

      # make
      make all-recursive
      make[1]: Entering directory `/root/reactor/cyrus-sasl-2.1.21'
      Making all in include
      make[2]: Entering directory `/root/reactor/cyrus-sasl-2.1.21/include'
      make[2]: Nothing to be done for `all'.
      make[2]: Leaving directory `/root/reactor/cyrus-sasl-2.1.21/include'
      Making all in sasldb
      make[2]: Entering directory `/root/reactor/cyrus-sasl-2.1.21/sasldb'
      ar cru .libs/libsasldb.a db_ndbm.o allockey.o
      make[2]: Leaving directory `/root/reactor/cyrus-sasl-2.1.21/sasldb'
      Making all in plugins
      make[2]: Entering directory `/root/reactor/cyrus-sasl-2.1.21/plugins'
      if /bin/bash ../libtool --mode=compile gcc -DHAVE_CONFIG_H -I. -I. -I.. -I../include -I../lib -I../sasldb -I../include    -Wall -W -g -O2 -MT digestmd5.lo -MD -MP -MF ".deps/digestmd5.Tpo" \
      -c -o digestmd5.lo `test -f 'digestmd5.c' || echo './'`digestmd5.c; \
      then mv ".deps/digestmd5.Tpo" ".deps/digestmd5.Plo"; \
      else rm -f ".deps/digestmd5.Tpo"; exit 1; \
      fi
      gcc -DHAVE_CONFIG_H -I. -I. -I.. -I../include -I../lib -I../sasldb -I../include -Wall -W -g -O2 -MT digestmd5.lo -MD -MP -MF .deps/digestmd5.Tpo -c digestmd5.c -fPIC -DPIC -o digestmd5.lo
      digestmd5.c:812: error: parse error before "des_key_schedule"
      digestmd5.c:812: warning: no semicolon at end of struct or union
      digestmd5.c:813: warning: type defaults to `int' in declaration of `ivec'
      digestmd5.c:813: warning: data definition has no type or storage class
      digestmd5.c:814: error: parse error before "keysched2"
      digestmd5.c:814: warning: type defaults to `int' in declaration of `keysched2'
      digestmd5.c:814: warning: data definition has no type or storage class
      digestmd5.c: In function `dec_3des':
      digestmd5.c:849: warning: implicit declaration of function `des_ede2_cbc_encrypt'
      digestmd5.c:852: error: dereferencing pointer to incomplete type
      digestmd5.c:853: error: dereferencing pointer to incomplete type
      digestmd5.c:854: error: dereferencing pointer to incomplete type
      digestmd5.c:855: error: `DES_DECRYPT' undeclared (first use in this function)
      digestmd5.c:855: error: (Each undeclared identifier is reported only once
      digestmd5.c:855: error: for each function it appears in.)
      digestmd5.c: In function `enc_3des':
      digestmd5.c:900: error: dereferencing pointer to incomplete type
      digestmd5.c:901: error: dereferencing pointer to incomplete type
      digestmd5.c:902: error: dereferencing pointer to incomplete type
      digestmd5.c:903: error: `DES_ENCRYPT' undeclared (first use in this function)
      digestmd5.c: In function `init_3des':
      digestmd5.c:918: error: invalid application of `sizeof' to incomplete type `digestmd5.c'
      digestmd5.c:923: warning: implicit declaration of function `des_key_sched'
      digestmd5.c:923: error: `des_cblock' undeclared (first use in this function)
      digestmd5.c:923: error: parse error before ')' token
      digestmd5.c:927: error: parse error before ')' token
      digestmd5.c:929: error: dereferencing pointer to incomplete type
      digestmd5.c:934: error: increment of pointer to unknown structure
      digestmd5.c:934: error: arithmetic on pointer to an incomplete type
      digestmd5.c:936: error: parse error before ')' token
      digestmd5.c:940: error: parse error before ')' token
      digestmd5.c:943: error: dereferencing pointer to incomplete type
      digestmd5.c: In function `dec_des':
      digestmd5.c:967: warning: implicit declaration of function `des_cbc_encrypt'
      digestmd5.c:970: error: dereferencing pointer to incomplete type
      digestmd5.c:971: error: dereferencing pointer to incomplete type
      digestmd5.c:972: error: `DES_DECRYPT' undeclared (first use in this function)
      digestmd5.c:976: error: dereferencing pointer to incomplete type
      digestmd5.c: In function `enc_des':
      digestmd5.c:1021: error: dereferencing pointer to incomplete type
      digestmd5.c:1022: error: dereferencing pointer to incomplete type
      digestmd5.c:1023: error: `DES_ENCRYPT' undeclared (first use in this function)
      digestmd5.c:1027: error: dereferencing pointer to incomplete type
      digestmd5.c: In function `init_des':
      digestmd5.c:1042: error: invalid application of `sizeof' to incomplete type `digestmd5.c'
      digestmd5.c:1047: error: `des_cblock' undeclared (first use in this function)
      digestmd5.c:1047: error: parse error before ')' token
      digestmd5.c:1049: error: dereferencing pointer to incomplete type
      digestmd5.c:1054: error: increment of pointer to unknown structure
      digestmd5.c:1054: error: arithmetic on pointer to an incomplete type
      digestmd5.c:1056: error: parse error before ')' token
      digestmd5.c:1058: error: dereferencing pointer to incomplete type
      digestmd5.c: In function `digestmd5_server_mech_step2':
      digestmd5.c:2095: warning: dereferencing type-punned pointer will break strict-aliasing rules
      digestmd5.c:2112: warning: dereferencing type-punned pointer will break strict-aliasing rules
      make[2]: *** [digestmd5.lo] Error 1
      make[2]: Leaving directory `/root/reactor/cyrus-sasl-2.1.21/plugins'
      make[1]: *** [all-recursive] Error 1
      make[1]: Leaving directory `/root/reactor/cyrus-sasl-2.1.21'
      make: *** [all] Error 2

      What`s the problem ??? I can`t understand :(