7 Replies Latest reply on Oct 13, 2006 10:20 PM by 807581

    Strange Error when starting tomcat 5.5.7

    807581
      Hello,

      on WinXP SP2 I am using JavaStudio Enterprise 8, with J2SE 1.5 update 9. I am trying to run the tomcat-servlet-example. The project compile properly, but when i run the project i get the error below. Since i have no clue how to overtake this, i ask assistance on fixing it.

      TIA,
      Luca

      Using CATALINA_BASE: C:\Documents and Settings\luca.C64\.jstudio\Ent8\jakarta-tomcat-5.5.7_base
      Using CATALINA_HOME: D:\Programmi\Sun\jstudio_ent8\ide\enterprise1\jakarta-tomcat-5.5.7
      Using CATALINA_TMPDIR: C:\Documents and Settings\luca.C64\.jstudio\Ent8\jakarta-tomcat-5.5.7_base\temp
      Using JAVA_HOME: C:\Programmi\Java\jdk1.5.0_09
      13-ott-2006 18.56.05 org.apache.coyote.http11.Http11Protocol init
      INFO: Initializing Coyote HTTP/1.1 on http-8080
      13-ott-2006 18.56.05 org.apache.catalina.startup.Catalina load
      INFO: Initialization processed in 1297 ms
      13-ott-2006 18.56.05 org.apache.tomcat.util.digester.Digester fatalError
      GRAVE: Parse Fatal Error at line 1 column 1: Content is not allowed in prolog.
      org.xml.sax.SAXParseException: Content is not allowed in prolog.
      at org.apache.xerces.util.ErrorHandlerWrapper.createSAXParseException(Unknown Source)
      at org.apache.xerces.util.ErrorHandlerWrapper.fatalError(Unknown Source)
      at org.apache.xerces.impl.XMLErrorReporter.reportError(Unknown Source)
      at org.apache.xerces.impl.XMLErrorReporter.reportError(Unknown Source)
      at org.apache.xerces.impl.XMLScanner.reportFatalError(Unknown Source)
      at org.apache.xerces.impl.XMLDocumentScannerImpl$PrologDispatcher.dispatch(Unknown Source)
      at org.apache.xerces.impl.XMLDocumentFragmentScannerImpl.scanDocument(Unknown Source)
      at org.apache.xerces.parsers.XML11Configuration.parse(Unknown Source)
      at org.apache.xerces.parsers.XML11Configuration.parse(Unknown Source)
      at org.apache.xerces.parsers.XMLParser.parse(Unknown Source)
      at org.apache.xerces.parsers.AbstractSAXParser.parse(Unknown Source)
      at org.apache.tomcat.util.digester.Digester.parse(Digester.java:1580)
      at org.apache.catalina.users.MemoryUserDatabase.open(MemoryUserDatabase.java:370)
      at org.apache.catalina.users.MemoryUserDatabaseFactory.getObjectInstance(MemoryUserDatabaseFactory.java:97)
      at org.apache.naming.factory.ResourceFactory.getObjectInstance(ResourceFactory.java:129)
      at javax.naming.spi.NamingManager.getObjectInstance(NamingManager.java:304)
      at org.apache.naming.NamingContext.lookup(NamingContext.java:792)
      at org.apache.naming.NamingContext.lookup(NamingContext.java:152)
      at org.apache.catalina.mbeans.GlobalResourcesLifecycleListener.createMBeans(GlobalResourcesLifecycleListener.java:138)
      at org.apache.catalina.mbeans.GlobalResourcesLifecycleListener.createMBeans(GlobalResourcesLifecycleListener.java:108)
      at org.apache.catalina.mbeans.GlobalResourcesLifecycleListener.lifecycleEvent(GlobalResourcesLifecycleListener.java:80)
      at org.apache.catalina.util.LifecycleSupport.fireLifecycleEvent(LifecycleSupport.java:119)
      at org.apache.catalina.core.StandardServer.start(StandardServer.java:676)
      at org.apache.catalina.startup.Catalina.start(Catalina.java:537)
      at sun.reflect.NativeMethodAccessorImpl.invoke0(Native Method)
      at sun.reflect.NativeMethodAccessorImpl.invoke(NativeMethodAccessorImpl.java:39)
      at sun.reflect.DelegatingMethodAccessorImpl.invoke(DelegatingMethodAccessorImpl.java:25)
      at java.lang.reflect.Method.invoke(Method.java:585)
      at org.apache.catalina.startup.Bootstrap.start(Bootstrap.java:271)
      at org.apache.catalina.startup.Bootstrap.main(Bootstrap.java:409)
      13-ott-2006 18.56.05 org.apache.naming.NamingContext lookup
      AVVERTENZA: Unexpected exception resolving reference
      org.xml.sax.SAXParseException: Content is not allowed in prolog.
      at org.apache.xerces.parsers.AbstractSAXParser.parse(Unknown Source)
      at org.apache.tomcat.util.digester.Digester.parse(Digester.java:1580)
      at org.apache.catalina.users.MemoryUserDatabase.open(MemoryUserDatabase.java:370)
      at org.apache.catalina.users.MemoryUserDatabaseFactory.getObjectInstance(MemoryUserDatabaseFactory.java:97)
      at org.apache.naming.factory.ResourceFactory.getObjectInstance(ResourceFactory.java:129)
      at javax.naming.spi.NamingManager.getObjectInstance(NamingManager.java:304)
      at org.apache.naming.NamingContext.lookup(NamingContext.java:792)
      at org.apache.naming.NamingContext.lookup(NamingContext.java:152)
      at org.apache.catalina.mbeans.GlobalResourcesLifecycleListener.createMBeans(GlobalResourcesLifecycleListener.java:138)
      at org.apache.catalina.mbeans.GlobalResourcesLifecycleListener.createMBeans(GlobalResourcesLifecycleListener.java:108)
      at org.apache.catalina.mbeans.GlobalResourcesLifecycleListener.lifecycleEvent(GlobalResourcesLifecycleListener.java:80)
      at org.apache.catalina.util.LifecycleSupport.fireLifecycleEvent(LifecycleSupport.java:119)
      at org.apache.catalina.core.StandardServer.start(StandardServer.java:676)
      at org.apache.catalina.startup.Catalina.start(Catalina.java:537)
      at sun.reflect.NativeMethodAccessorImpl.invoke0(Native Method)
      at sun.reflect.NativeMethodAccessorImpl.invoke(NativeMethodAccessorImpl.java:39)
      at sun.reflect.DelegatingMethodAccessorImpl.invoke(DelegatingMethodAccessorImpl.java:25)
      at java.lang.reflect.Method.invoke(Method.java:585)
      at org.apache.catalina.startup.Bootstrap.start(Bootstrap.java:271)
      at org.apache.catalina.startup.Bootstrap.main(Bootstrap.java:409)
      13-ott-2006 18.56.05 org.apache.catalina.mbeans.GlobalResourcesLifecycleListener createMBeans
      GRAVE: Exception processing Global JNDI Resources
      javax.naming.NamingException: Content is not allowed in prolog.
      at org.apache.naming.NamingContext.lookup(NamingContext.java:804)
      at org.apache.naming.NamingContext.lookup(NamingContext.java:152)
      at org.apache.catalina.mbeans.GlobalResourcesLifecycleListener.createMBeans(GlobalResourcesLifecycleListener.java:138)
      at org.apache.catalina.mbeans.GlobalResourcesLifecycleListener.createMBeans(GlobalResourcesLifecycleListener.java:108)
      at org.apache.catalina.mbeans.GlobalResourcesLifecycleListener.lifecycleEvent(GlobalResourcesLifecycleListener.java:80)
      at org.apache.catalina.util.LifecycleSupport.fireLifecycleEvent(LifecycleSupport.java:119)
      at org.apache.catalina.core.StandardServer.start(StandardServer.java:676)
      at org.apache.catalina.startup.Catalina.start(Catalina.java:537)
      at sun.reflect.NativeMethodAccessorImpl.invoke0(Native Method)
      at sun.reflect.NativeMethodAccessorImpl.invoke(NativeMethodAccessorImpl.java:39)
      at sun.reflect.DelegatingMethodAccessorImpl.invoke(DelegatingMethodAccessorImpl.java:25)
      at java.lang.reflect.Method.invoke(Method.java:585)
      at org.apache.catalina.startup.Bootstrap.start(Bootstrap.java:271)
      at org.apache.catalina.startup.Bootstrap.main(Bootstrap.java:409)
      13-ott-2006 18.56.05 org.apache.catalina.core.StandardService start
      INFO: Starting service Catalina
      13-ott-2006 18.56.05 org.apache.catalina.core.StandardEngine start
      INFO: Starting Servlet Engine: Apache Tomcat/5.5.7
      13-ott-2006 18.56.05 org.apache.tomcat.util.digester.Digester fatalError
      GRAVE: Parse Fatal Error at line 1 column 1: Content is not allowed in prolog.
      org.xml.sax.SAXParseException: Content is not allowed in prolog.
      at org.apache.xerces.util.ErrorHandlerWrapper.createSAXParseException(Unknown Source)
      at org.apache.xerces.util.ErrorHandlerWrapper.fatalError(Unknown Source)
      at org.apache.xerces.impl.XMLErrorReporter.reportError(Unknown Source)
      at org.apache.xerces.impl.XMLErrorReporter.reportError(Unknown Source)
      at org.apache.xerces.impl.XMLScanner.reportFatalError(Unknown Source)
      at org.apache.xerces.impl.XMLDocumentScannerImpl$PrologDispatcher.dispatch(Unknown Source)
      at org.apache.xerces.impl.XMLDocumentFragmentScannerImpl.scanDocument(Unknown Source)
      at org.apache.xerces.parsers.XML11Configuration.parse(Unknown Source)
      at org.apache.xerces.parsers.XML11Configuration.parse(Unknown Source)
      at org.apache.xerces.parsers.XMLParser.parse(Unknown Source)
      at org.apache.xerces.parsers.AbstractSAXParser.parse(Unknown Source)
      at org.apache.tomcat.util.digester.Digester.parse(Digester.java:1580)
      at org.apache.catalina.users.MemoryUserDatabase.open(MemoryUserDatabase.java:370)
      at org.apache.catalina.users.MemoryUserDatabaseFactory.getObjectInstance(MemoryUserDatabaseFactory.java:97)
      at org.apache.naming.factory.ResourceFactory.getObjectInstance(ResourceFactory.java:129)
      at javax.naming.spi.NamingManager.getObjectInstance(NamingManager.java:304)
      at org.apache.naming.NamingContext.lookup(NamingContext.java:792)
      at org.apache.naming.NamingContext.lookup(NamingContext.java:152)
      at org.apache.catalina.realm.UserDatabaseRealm.start(UserDatabaseRealm.java:222)
      at org.apache.catalina.core.ContainerBase.start(ContainerBase.java:1003)
      at org.apache.catalina.core.StandardEngine.start(StandardEngine.java:440)
      at org.apache.catalina.core.StandardService.start(StandardService.java:450)
      at org.apache.catalina.core.StandardServer.start(StandardServer.java:683)
      at org.apache.catalina.startup.Catalina.start(Catalina.java:537)
      at sun.reflect.NativeMethodAccessorImpl.invoke0(Native Method)
      at sun.reflect.NativeMethodAccessorImpl.invoke(NativeMethodAccessorImpl.java:39)
      at sun.reflect.DelegatingMethodAccessorImpl.invoke(DelegatingMethodAccessorImpl.java:25)
      at java.lang.reflect.Method.invoke(Method.java:585)
      at org.apache.catalina.startup.Bootstrap.start(Bootstrap.java:271)
      at org.apache.catalina.startup.Bootstrap.main(Bootstrap.java:409)
      13-ott-2006 18.56.05 org.apache.naming.NamingContext lookup
      AVVERTENZA: Unexpected exception resolving reference
      org.xml.sax.SAXParseException: Content is not allowed in prolog.
      at org.apache.xerces.parsers.AbstractSAXParser.parse(Unknown Source)
      at org.apache.tomcat.util.digester.Digester.parse(Digester.java:1580)
      at org.apache.catalina.users.MemoryUserDatabase.open(MemoryUserDatabase.java:370)
      at org.apache.catalina.users.MemoryUserDatabaseFactory.getObjectInstance(MemoryUserDatabaseFactory.java:97)
      at org.apache.naming.factory.ResourceFactory.getObjectInstance(ResourceFactory.java:129)
      at javax.naming.spi.NamingManager.getObjectInstance(NamingManager.java:304)
      at org.apache.naming.NamingContext.lookup(NamingContext.java:792)
      at org.apache.naming.NamingContext.lookup(NamingContext.java:152)
      at org.apache.catalina.realm.UserDatabaseRealm.start(UserDatabaseRealm.java:222)
      at org.apache.catalina.core.ContainerBase.start(ContainerBase.java:1003)
      at org.apache.catalina.core.StandardEngine.start(StandardEngine.java:440)
      at org.apache.catalina.core.StandardService.start(StandardService.java:450)
      at org.apache.catalina.core.StandardServer.start(StandardServer.java:683)
      at org.apache.catalina.startup.Catalina.start(Catalina.java:537)
      at sun.reflect.NativeMethodAccessorImpl.invoke0(Native Method)
      at sun.reflect.NativeMethodAccessorImpl.invoke(NativeMethodAccessorImpl.java:39)
      at sun.reflect.DelegatingMethodAccessorImpl.invoke(DelegatingMethodAccessorImpl.java:25)
      at java.lang.reflect.Method.invoke(Method.java:585)
      at org.apache.catalina.startup.Bootstrap.start(Bootstrap.java:271)
      at org.apache.catalina.startup.Bootstrap.main(Bootstrap.java:409)
      13-ott-2006 18.56.05 org.apache.catalina.realm.UserDatabaseRealm start
      GRAVE: Exception looking up UserDatabase under key UserDatabase
      javax.naming.NamingException: Content is not allowed in prolog.
      at org.apache.naming.NamingContext.lookup(NamingContext.java:804)
      at org.apache.naming.NamingContext.lookup(NamingContext.java:152)
      at org.apache.catalina.realm.UserDatabaseRealm.start(UserDatabaseRealm.java:222)
      at org.apache.catalina.core.ContainerBase.start(ContainerBase.java:1003)
      at org.apache.catalina.core.StandardEngine.start(StandardEngine.java:440)
      at org.apache.catalina.core.StandardService.start(StandardService.java:450)
      at org.apache.catalina.core.StandardServer.start(StandardServer.java:683)
      at org.apache.catalina.startup.Catalina.start(Catalina.java:537)
      at sun.reflect.NativeMethodAccessorImpl.invoke0(Native Method)
      at sun.reflect.NativeMethodAccessorImpl.invoke(NativeMethodAccessorImpl.java:39)
      at sun.reflect.DelegatingMethodAccessorImpl.invoke(DelegatingMethodAccessorImpl.java:25)
      at java.lang.reflect.Method.invoke(Method.java:585)
      at org.apache.catalina.startup.Bootstrap.start(Bootstrap.java:271)
      at org.apache.catalina.startup.Bootstrap.main(Bootstrap.java:409)
      13-ott-2006 18.56.05 org.apache.catalina.startup.Catalina start
      GRAVE: Catalina.start:
      LifecycleException: No UserDatabase component found under key UserDatabase
      at org.apache.catalina.realm.UserDatabaseRealm.start(UserDatabaseRealm.java:228)
      at org.apache.catalina.core.ContainerBase.start(ContainerBase.java:1003)
      at org.apache.catalina.core.StandardEngine.start(StandardEngine.java:440)
      at org.apache.catalina.core.StandardService.start(StandardService.java:450)
      at org.apache.catalina.core.StandardServer.start(StandardServer.java:683)
      at org.apache.catalina.startup.Catalina.start(Catalina.java:537)
      at sun.reflect.NativeMethodAccessorImpl.invoke0(Native Method)
      at sun.reflect.NativeMethodAccessorImpl.invoke(NativeMethodAccessorImpl.java:39)
      at sun.reflect.DelegatingMethodAccessorImpl.invoke(DelegatingMethodAccessorImpl.java:25)
      at java.lang.reflect.Method.invoke(Method.java:585)
      at org.apache.catalina.startup.Bootstrap.start(Bootstrap.java:271)
      at org.apache.catalina.startup.Bootstrap.main(Bootstrap.java:409)
      13-ott-2006 18.56.05 org.apache.catalina.startup.Catalina start
      INFO: Server startup in 391 ms
      13-ott-2006 18.56.05 org.apache.catalina.core.StandardServer await
      GRAVE: StandardServer.await: create[8025]:
      java.net.BindException: Address already in use: JVM_Bind
      at java.net.PlainSocketImpl.socketBind(Native Method)
      at java.net.PlainSocketImpl.bind(PlainSocketImpl.java:359)
      at java.net.ServerSocket.bind(ServerSocket.java:319)
      at java.net.ServerSocket.<init>(ServerSocket.java:185)
      at org.apache.catalina.core.StandardServer.await(StandardServer.java:346)
      at org.apache.catalina.startup.Catalina.await(Catalina.java:600)
      at org.apache.catalina.startup.Catalina.start(Catalina.java:560)
      at sun.reflect.NativeMethodAccessorImpl.invoke0(Native Method)
      at sun.reflect.NativeMethodAccessorImpl.invoke(NativeMethodAccessorImpl.java:39)
      at sun.reflect.DelegatingMethodAccessorImpl.invoke(DelegatingMethodAccessorImpl.java:25)
      at java.lang.reflect.Method.invoke(Method.java:585)
      at org.apache.catalina.startup.Bootstrap.start(Bootstrap.java:271)
      at org.apache.catalina.startup.Bootstrap.main(Bootstrap.java:409)
      13-ott-2006 18.56.05 org.apache.coyote.http11.Http11Protocol pause
      INFO: Pausing Coyote HTTP/1.1 on http-8080
        • 1. Re: Strange Error when starting tomcat 5.5.7
          807581
          Can u pl. check the thread at http://forum.java.sun.com/thread.jspa?threadID=567285? There seem to be several reasons why this error could happen, namely,


          ...I've also found that some text editors will add a BOM (Byte-Order Mark) to UTF-8 files...
          ...I had the same exception occurring using jstl to parse an xml document. The problem? File not found! ...


          Also:
          1. http://mail-archives.apache.org/mod_mbox/ibatis-user-java/200605.mbox/%3c446BB0D9.40107@cpsc.ucalgary.ca%3e
          2. There may be conflicting libraries in the classpath (especially xalan, xerces, tomcat commons lib etc)...
          • 2. Re: Strange Error when starting tomcat 5.5.7
            807581
            Oh, i have resolved that problem simply erasing the directory related to SunStudio under Documents&Settings. Now i created the tutorial project by scratch, and i almost got it working, but i have the problem you could see at the end of the appended log below.

            In particular the error is:
            deploy?config=file:/C:/DOCUME~1/luca.C64/IMPOST~1/Temp/context33855.xml&path=/TomcatServletExample1
            Server returned HTTP response code: 403 for URL:
            http://localhost:8080/manager/deploy?config=file:/C:/DOCUME~1/luca.C64/IMPOST~1/Temp/context33855.xml&path=/TomcatServletExample1

            Any hint?

            TIA





            ********************************************

            init:
            deps-module-jar:
            deps-ear-jar:
            deps-jar:
            library-inclusion-in-archive:
            library-inclusion-in-manifest:
            compile:
            compile-jsps:
            do-dist:
            dist:
            debug:
            Starting debug server Bundled Tomcat (5.5.7)
            Starting Tomcat process...
            Tomcat server started.
            In-place deployment at C:\Documents and Settings\luca.C64\TomcatServletExample1\build\web
            deploy?config=file:/C:/DOCUME~1/luca.C64/IMPOST~1/Temp/context33855.xml&path=/TomcatServletExample1
            Server returned HTTP response code: 403 for URL: http://localhost:8080/manager/deploy?config=file:/C:/DOCUME~1/luca.C64/IMPOST~1/Temp/context33855.xml&path=/TomcatServletExample1
            C:\Documents and Settings\luca.C64\TomcatServletExample1\nbproject\build-impl.xml:373: Deployment failed.
            BUILD FAILED (total time: 46 seconds)
            • 3. Re: Strange Error when starting tomcat 5.5.7
              807581
              The error seems to happen with the debug version of tomcat:
              ...
              debug:
              Starting debug server Bundled Tomcat (5.5.7)
              ...

              Have you tried 'run project' command? In other words does the deploy also fail when tomcat is started in non-debug mode?

              You may also want to increase the verbosity level of ant messages that may pin-point the problem:
              - Select Tools | Options menuitem
              -- Select Options | Building | Ant Settings
              - Set the verbosity level to 'debug' or 'verbose'.
              • 4. Re: Strange Error when starting tomcat 5.5.7
                807581
                Hello,

                I have set the verbosity of Ant to Debug, and the resulting log after clicking on the Run Main Project button is here below. The same error happens in Debug Maing Project.

                It seems to be difficult to get it working, and i cant understand why. After all, i used it for 1 year without problems, and now i m struggling...

                See you,
                Luca


                Adding reference: ant.PropertyHelper
                Detected Java version: 1.5 in: C:\Programmi\Java\jdk1.5.0_09\jre
                Detected OS: Windows XP
                Adding reference: ant.ComponentHelper
                parsing buildfile jar:file:/D:/Programmi/Sun/jstudio_ent8/ide/ide5/ant/nblib/org-netbeans-modules-ant-browsetask.jar!/org/netbeans/modules/ant/browsetask/antlib.xml with URI = jar:file:/D:/Programmi/Sun/jstudio_ent8/ide/ide5/ant/nblib/org-netbeans-modules-ant-browsetask.jar!/org/netbeans/modules/ant/browsetask/antlib.xml
                +Datatype nbbrowse org.netbeans.modules.ant.browsetask.NbBrowse
                parsing buildfile jar:file:/D:/Programmi/Sun/jstudio_ent8/ide/ide5/ant/nblib/org-netbeans-modules-ant-browsetask.jar!/org/netbeans/modules/ant/browsetask/antlib.xml with URI = jar:file:/D:/Programmi/Sun/jstudio_ent8/ide/ide5/ant/nblib/org-netbeans-modules-ant-browsetask.jar!/org/netbeans/modules/ant/browsetask/antlib.xml
                +Datatype antlib:org.netbeans.modules.ant.browsetask:nbbrowse org.netbeans.modules.ant.browsetask.NbBrowse
                parsing buildfile jar:file:/D:/Programmi/Sun/jstudio_ent8/ide/ide5/ant/nblib/org-netbeans-modules-debugger-jpda-ant.jar!/org/netbeans/modules/debugger/jpda/ant/antlib.xml with URI = jar:file:/D:/Programmi/Sun/jstudio_ent8/ide/ide5/ant/nblib/org-netbeans-modules-debugger-jpda-ant.jar!/org/netbeans/modules/debugger/jpda/ant/antlib.xml
                +Datatype nbjpdaconnect org.netbeans.modules.debugger.jpda.ant.JPDAConnect
                +Datatype nbjpdastart org.netbeans.modules.debugger.jpda.ant.JPDAStart
                +Datatype nbjpdareload org.netbeans.modules.debugger.jpda.ant.JPDAReload
                parsing buildfile jar:file:/D:/Programmi/Sun/jstudio_ent8/ide/ide5/ant/nblib/org-netbeans-modules-debugger-jpda-ant.jar!/org/netbeans/modules/debugger/jpda/ant/antlib.xml with URI = jar:file:/D:/Programmi/Sun/jstudio_ent8/ide/ide5/ant/nblib/org-netbeans-modules-debugger-jpda-ant.jar!/org/netbeans/modules/debugger/jpda/ant/antlib.xml
                +Datatype antlib:org.netbeans.modules.debugger.jpda.ant:nbjpdaconnect org.netbeans.modules.debugger.jpda.ant.JPDAConnect
                +Datatype antlib:org.netbeans.modules.debugger.jpda.ant:nbjpdastart org.netbeans.modules.debugger.jpda.ant.JPDAStart
                +Datatype antlib:org.netbeans.modules.debugger.jpda.ant:nbjpdareload org.netbeans.modules.debugger.jpda.ant.JPDAReload
                parsing buildfile jar:file:/D:/Programmi/Sun/jstudio_ent8/ide/enterprise1/ant/nblib/org-netbeans-modules-j2ee-ant.jar!/org/netbeans/modules/j2ee/ant/antlib.xml with URI = jar:file:/D:/Programmi/Sun/jstudio_ent8/ide/enterprise1/ant/nblib/org-netbeans-modules-j2ee-ant.jar!/org/netbeans/modules/j2ee/ant/antlib.xml
                +Datatype nbdeploy org.netbeans.modules.j2ee.ant.Deploy
                +Datatype nbverify org.netbeans.modules.j2ee.ant.Verify
                parsing buildfile jar:file:/D:/Programmi/Sun/jstudio_ent8/ide/enterprise1/ant/nblib/org-netbeans-modules-j2ee-ant.jar!/org/netbeans/modules/j2ee/ant/antlib.xml with URI = jar:file:/D:/Programmi/Sun/jstudio_ent8/ide/enterprise1/ant/nblib/org-netbeans-modules-j2ee-ant.jar!/org/netbeans/modules/j2ee/ant/antlib.xml
                +Datatype antlib:org.netbeans.modules.j2ee.ant:nbdeploy org.netbeans.modules.j2ee.ant.Deploy
                +Datatype antlib:org.netbeans.modules.j2ee.ant:nbverify org.netbeans.modules.j2ee.ant.Verify
                parsing buildfile jar:file:/D:/Programmi/Sun/jstudio_ent8/ide/enterprise1/ant/nblib/org-netbeans-modules-j2ee-sun-ide.jar!/org/netbeans/modules/j2ee/sun/ide/antlib.xml with URI = jar:file:/D:/Programmi/Sun/jstudio_ent8/ide/enterprise1/ant/nblib/org-netbeans-modules-j2ee-sun-ide.jar!/org/netbeans/modules/j2ee/sun/ide/antlib.xml
                +Datatype sun-appserv-deploy org.apache.tools.ant.taskdefs.optional.sun.appserv.DeployTask
                +Datatype sun-appserv-undeploy org.apache.tools.ant.taskdefs.optional.sun.appserv.UndeployTask
                +Datatype sun-appserv-instance org.apache.tools.ant.taskdefs.optional.sun.appserv.InstanceTask
                +Datatype sun-appserv-component org.apache.tools.ant.taskdefs.optional.sun.appserv.ComponentTask
                +Datatype sun-appserv-admin org.apache.tools.ant.taskdefs.optional.sun.appserv.AdminTask
                +Datatype sun-appserv-input org.apache.tools.ant.taskdefs.Input
                +Datatype sun-appserv-jspc org.apache.tools.ant.taskdefs.optional.sun.appserv.SunJspc
                +Datatype sun-appserv-update org.apache.tools.ant.taskdefs.optional.sun.appserv.UpdateTask
                parsing buildfile jar:file:/D:/Programmi/Sun/jstudio_ent8/ide/enterprise1/ant/nblib/org-netbeans-modules-j2ee-sun-ide.jar!/org/netbeans/modules/j2ee/sun/ide/antlib.xml with URI = jar:file:/D:/Programmi/Sun/jstudio_ent8/ide/enterprise1/ant/nblib/org-netbeans-modules-j2ee-sun-ide.jar!/org/netbeans/modules/j2ee/sun/ide/antlib.xml
                +Datatype antlib:org.netbeans.modules.j2ee.sun.ide:sun-appserv-deploy org.apache.tools.ant.taskdefs.optional.sun.appserv.DeployTask
                +Datatype antlib:org.netbeans.modules.j2ee.sun.ide:sun-appserv-undeploy org.apache.tools.ant.taskdefs.optional.sun.appserv.UndeployTask
                +Datatype antlib:org.netbeans.modules.j2ee.sun.ide:sun-appserv-instance org.apache.tools.ant.taskdefs.optional.sun.appserv.InstanceTask
                +Datatype antlib:org.netbeans.modules.j2ee.sun.ide:sun-appserv-component org.apache.tools.ant.taskdefs.optional.sun.appserv.ComponentTask
                +Datatype antlib:org.netbeans.modules.j2ee.sun.ide:sun-appserv-admin org.apache.tools.ant.taskdefs.optional.sun.appserv.AdminTask
                +Datatype antlib:org.netbeans.modules.j2ee.sun.ide:sun-appserv-input org.apache.tools.ant.taskdefs.Input
                +Datatype antlib:org.netbeans.modules.j2ee.sun.ide:sun-appserv-jspc org.apache.tools.ant.taskdefs.optional.sun.appserv.SunJspc
                +Datatype antlib:org.netbeans.modules.j2ee.sun.ide:sun-appserv-update org.apache.tools.ant.taskdefs.optional.sun.appserv.UpdateTask
                Setting ro project property: ant.file -> C:\Documents and Settings\luca.C64\TomcatServletExample1\build.xml
                Setting ro project property: ant.version -> Apache Ant version 1.6.2 compiled on July 16 2004
                Setting ro project property: ant.home -> D:\Programmi\Sun\jstudio_ent8\ide\ide5\ant
                Setting ro project property: forceRedeploy -> false
                Setting ro project property: build.compiler.emacs -> true
                Adding reference: ant.projectHelper
                Adding reference: ant.parsing.context
                Adding reference: ant.targets
                parsing buildfile C:\Documents and Settings\luca.C64\TomcatServletExample1\build.xml with URI = file:///C:/Documents%20and%20Settings/luca.C64/TomcatServletExample1/build.xml
                Setting ro project property: ant.project.name -> TomcatServletExample
                Adding reference: TomcatServletExample
                Setting ro project property: ant.file.TomcatServletExample -> C:\Documents and Settings\luca.C64\TomcatServletExample1\build.xml
                Project base dir set to: C:\Documents and Settings\luca.C64\TomcatServletExample1
                +Target:
                Importing file nbproject/build-impl.xml from C:\Documents and Settings\luca.C64\TomcatServletExample1\build.xml
                parsing buildfile C:\Documents and Settings\luca.C64\TomcatServletExample1\nbproject\build-impl.xml with URI = file:///C:/Documents%20and%20Settings/luca.C64/TomcatServletExample1/nbproject/build-impl.xml
                Setting ro project property: ant.file.TomcatServletExample-impl -> C:\Documents and Settings\luca.C64\TomcatServletExample1\nbproject\build-impl.xml
                +Target: default
                +Target: -pre-init
                +Target: -init-private
                +Target: -init-user
                +Target: -init-project
                +Target: -do-ear-init
                +Target: -do-init
                +Target: -post-init
                +Target: -init-check
                +Target: -init-macrodef-property
                +Target: -init-macrodef-javac
                +Target: -init-macrodef-junit
                +Target: -init-macrodef-java
                +Target: -init-macrodef-nbjpda
                +Target: -init-macrodef-debug
                +Target: init
                +Target: deps-module-jar
                +Target: deps-ear-jar
                +Target: deps-jar
                +Target: -pre-pre-compile
                +Target: -pre-compile
                +Target: -do-compile
                +Target: -copy-manifest
                +Target: -post-compile
                +Target: compile
                +Target: -pre-compile-single
                +Target: -do-compile-single
                +Target: -post-compile-single
                +Target: compile-single
                +Target: compile-jsps
                +Target: -do-compile-single-jsp
                +Target: compile-single-jsp
                +Target: -pre-dist
                +Target: -do-dist-without-manifest
                +Target: -do-dist-with-manifest
                +Target: do-dist
                +Target: library-inclusion-in-manifest
                +Target: library-inclusion-in-archive
                +Target: do-ear-dist
                +Target: -post-dist
                +Target: dist
                +Target: dist-ear
                +Target: run
                +Target: run-deploy
                +Target: verify
                +Target: run-display-browser
                +Target: run-main
                +Target: debug
                +Target: debug-display-browser
                +Target: debug-single
                +Target: -debug-start-debugger
                +Target: -debug-start-debuggee-single
                +Target: debug-single-main
                +Target: -pre-debug-fix
                +Target: -do-debug-fix
                +Target: debug-fix
                +Target: javadoc-build
                +Target: javadoc-browse
                +Target: javadoc
                +Target: -pre-pre-compile-test
                +Target: -pre-compile-test
                +Target: -do-compile-test
                +Target: -post-compile-test
                +Target: compile-test
                +Target: -pre-compile-test-single
                +Target: -do-compile-test-single
                +Target: -post-compile-test-single
                +Target: compile-test-single
                +Target: -pre-test-run
                +Target: -do-test-run
                +Target: -post-test-run
                +Target: test-report
                +Target: -test-browse
                +Target: test
                +Target: -pre-test-run-single
                +Target: -do-test-run-single
                +Target: -post-test-run-single
                +Target: test-single
                +Target: -debug-start-debuggee-test
                +Target: -debug-start-debugger-test
                +Target: debug-test
                +Target: -do-debug-fix-test
                +Target: debug-fix-test
                +Target: deps-clean
                +Target: do-clean
                +Target: check-clean
                +Target: -post-clean
                +Target: clean
                +Target: clean-ear
                Build sequence for target `run' is [-pre-init, -init-private, -init-user, -init-project, -init-macrodef-property, -do-ear-init, -do-init, -post-init, -init-check, -init-macrodef-javac, -init-macrodef-junit, -init-macrodef-java, -init-macrodef-nbjpda, -init-macrodef-debug, init, deps-module-jar, deps-ear-jar, deps-jar, -pre-pre-compile, -pre-compile, -copy-manifest, library-inclusion-in-archive, library-inclusion-in-manifest, -do-compile, -post-compile, compile, compile-jsps, -do-compile-single-jsp, -pre-dist, -do-dist-with-manifest, -do-dist-without-manifest, do-dist, -post-dist, dist, run-deploy, run-display-browser, run]
                Complete build sequence is [-pre-init, -init-private, -init-user, -init-project, -init-macrodef-property, -do-ear-init, -do-init, -post-init, -init-check, -init-macrodef-javac, -init-macrodef-junit, -init-macrodef-java, -init-macrodef-nbjpda, -init-macrodef-debug, init, deps-module-jar, deps-ear-jar, deps-jar, -pre-pre-compile, -pre-compile, -copy-manifest, library-inclusion-in-archive, library-inclusion-in-manifest, -do-compile, -post-compile, compile, compile-jsps, -do-compile-single-jsp, -pre-dist, -do-dist-with-manifest, -do-dist-without-manifest, do-dist, -post-dist, dist, run-deploy, run-display-browser, run, debug-display-browser, -post-compile-test-single, -pre-test-run, -pre-compile-single, -do-compile-single, -post-compile-single, compile-single, run-main, -pre-pre-compile-test, -pre-compile-test, -do-compile-test, -post-compile-test, compile-test, debug, javadoc-build, compile-single-jsp, -debug-start-debugger-test, -debug-start-debuggee-test, debug-test, -do-test-run, test-report, debug-single, do-clean, check-clean, -pre-test-run-single, javadoc-browse, javadoc, default, -pre-compile-test-single, -do-compile-test-single, compile-test-single, -do-test-run-single, do-ear-dist, -post-test-run-single, -post-test-run, -test-browse, test, dist-ear, deps-clean, -post-clean, clean, -pre-debug-fix, -do-debug-fix, debug-fix, -do-debug-fix-test, -debug-start-debuggee-single, clean-ear, -debug-start-debugger, verify, debug-fix-test, test-single, debug-single-main, ]
                -pre-init:
                -init-private:
                Loading C:\Documents and Settings\luca.C64\TomcatServletExample1\nbproject\private\private.properties
                Setting project property: javac.debug -> true
                Setting project property: javadoc.preview -> true
                Setting project property: j2ee.platform.classpath -> D:\Programmi\Sun\jstudio_ent8\ide\enterprise1\jakarta-tomcat-5.5.7\common\lib\jsp-api.jar:D:\Programmi\Sun\jstudio_ent8\ide\enterprise1\jakarta-tomcat-5.5.7\common\lib\servlet-api.jar
                Setting project property: j2ee.server.instance -> tomcat55:home=$bundled_home:base=$bundled_base
                Setting project property: user.properties.file -> C:\Documents and Settings\luca.C64\.jstudio\Ent8\build.properties
                -init-user:
                Loading C:\Documents and Settings\luca.C64\.jstudio\Ent8\build.properties
                Setting project property: libs.absolutelayout.src ->
                Setting project property: libs.absolutelayout.classpath -> D:\Programmi\Sun\jstudio_ent8\ide\ide5\modules\ext\AbsoluteLayout.jar
                Setting project property: wsclientuptodate.classpath -> D:\Programmi\Sun\jstudio_ent8\ide\enterprise1\ant\extra\wsclientuptodate.jar
                Setting project property: default.javac.target -> 1.5
                Setting project property: libs.jstl11.classpath -> D:\Programmi\Sun\jstudio_ent8\ide\enterprise1\config\TagLibraries\JSTL11\standard.jar;D:\Programmi\Sun\jstudio_ent8\ide\enterprise1\config\TagLibraries\JSTL11\jstl.jar
                Setting project property: libs.jstl11.src ->
                Setting project property: libs.absolutelayout.javadoc ->
                Setting project property: libs.PortletBuilder.src ->
                Setting project property: copyfiles.classpath -> D:\Programmi\Sun\jstudio_ent8\ide\enterprise1\ant\extra\copyfiles.jar
                Setting project property: libs.PortletBuilder.javadoc ->
                Setting project property: libs.junit.src ->
                Setting project property: default.javac.source -> 1.5
                Setting project property: libs.junit.javadoc -> D:\Programmi\Sun\jstudio_ent8\ide\ide5\docs\junit-3.8.1-api.zip
                Setting project property: libs.junit.classpath -> D:\Programmi\Sun\jstudio_ent8\ide\ide5\modules\ext\junit-3.8.1.jar
                Setting project property: libs.jstl11.javadoc -> D:\Programmi\Sun\jstudio_ent8\ide\enterprise1\docs\jstl-1.1.2-javadoc.zip
                Setting project property: jspc.classpath -> D:\Programmi\Sun\jstudio_ent8\ide\ide5\ant\lib\ant.jar:D:\Programmi\Sun\jstudio_ent8\ide\enterprise1\jakarta-tomcat-5.5.7\common\lib\jsp-api.jar:D:\Programmi\Sun\jstudio_ent8\ide\enterprise1\jakarta-tomcat-5.5.7\common\lib\servlet-api.jar:D:\Programmi\Sun\jstudio_ent8\ide\enterprise1\modules\autoload\ext\jasper-compiler-5.5.7.jar:D:\Programmi\Sun\jstudio_ent8\ide\enterprise1\modules\autoload\ext\jasper-runtime-5.5.7.jar:D:\Programmi\Sun\jstudio_ent8\ide\enterprise1\modules\autoload\ext\commons-el.jar:D:\Programmi\Sun\jstudio_ent8\ide\ide5\modules\ext\commons-logging-1.0.4.jar
                Setting project property: libs.PortletBuilder.classpath -> D:\Programmi\Sun\jstudio_ent8\ide\portletbuilder1\modules\ext\common.jar;D:\Programmi\Sun\jstudio_ent8\ide\portletbuilder1\modules\ext\container.jar;D:\Programmi\Sun\jstudio_ent8\ide\portletbuilder1\modules\ext\jdom.jar;D:\Programmi\Sun\jstudio_ent8\ide\portletbuilder1\modules\ext\portlet.jar;D:\Programmi\Sun\jstudio_ent8\ide\portletbuilder1\modules\ext\portletappengine.jar;D:\Programmi\Sun\jstudio_ent8\ide\portletbuilder1\modules\ext\portletcontainercommon.jar;D:\Programmi\Sun\jstudio_ent8\ide\portletbuilder1\modules\ext\portlettl.jar;D:\Programmi\Sun\jstudio_ent8\ide\portletbuilder1\modules\ext\psrun.jar
                Override ignored for property default.javac.source
                Override ignored for property default.javac.target
                -init-project:
                Loading C:\Documents and Settings\luca.C64\TomcatServletExample1\nbproject\project.properties
                Setting project property: javac.deprecation -> true
                Setting project property: build.test.results.dir -> build/test/results
                Setting project property: javadoc.nonavbar -> false
                Setting project property: war.name -> TomcatServletExample.war
                Setting project property: run.test.classpath -> :build/web/WEB-INF/classes:D:\Programmi\Sun\jstudio_ent8\ide\ide5\modules\ext\junit-3.8.1.jar:build/test/classes
                Setting project property: javac.target -> 1.5
                Setting project property: j2ee.server.type -> Tomcat55
                Setting project property: client.urlPart ->
                Setting project property: display.browser -> true
                Setting project property: javadoc.noindex -> false
                Setting project property: web.docbase.dir -> web
                Setting project property: source.root -> src
                Setting project property: build.classes.dir -> build/web/WEB-INF/classes
                Setting project property: javadoc.author -> false
                Setting project property: test.src.dir -> test
                Setting project property: build.dir -> build
                Setting project property: build.ear.web.dir -> build/ear-module
                Setting project property: resource.dir -> setup
                Setting project property: war.ear.name -> TomcatServletExample.war
                Setting project property: build.test.classes.dir -> build/test/classes
                Setting project property: platform.active -> default_platform
                Setting project property: javac.compilerargs ->
                Setting project property: javadoc.use -> true
                Setting project property: lib.dir -> web/WEB-INF/lib
                Setting project property: build.web.excludes -> **/*.java,**/*.form
                Setting project property: debug.test.classpath -> :build/web/WEB-INF/classes:D:\Programmi\Sun\jstudio_ent8\ide\ide5\modules\ext\junit-3.8.1.jar:build/test/classes
                Setting project property: dist.dir -> dist
                Setting project property: build.classes.excludes -> **/*.java,**/*.form
                Setting project property: javadoc.splitindex -> true
                Setting project property: javadoc.encoding ->
                Setting project property: javac.source -> 1.5
                Override ignored for property javadoc.preview
                Setting project property: debug.classpath -> :build/web/WEB-INF/classes
                Setting project property: compile.jsps -> false
                Setting project property: build.web.dir -> build/web
                Setting project property: runmain.jvmargs ->
                Setting project property: conf.dir -> src/conf
                Setting project property: build.generated.dir -> build/generated
                Setting project property: jar.compress -> false
                Setting project property: javac.test.classpath -> :build/web/WEB-INF/classes:D:\Programmi\Sun\jstudio_ent8\ide\ide5\modules\ext\junit-3.8.1.jar
                Setting project property: javadoc.private -> false
                Override ignored for property javac.debug
                Setting project property: war.content.additional ->
                Setting project property: jspcompilation.classpath -> D:\Programmi\Sun\jstudio_ent8\ide\ide5\ant\lib\ant.jar:D:\Programmi\Sun\jstudio_ent8\ide\enterprise1\jakarta-tomcat-5.5.7\common\lib\jsp-api.jar:D:\Programmi\Sun\jstudio_ent8\ide\enterprise1\jakarta-tomcat-5.5.7\common\lib\servlet-api.jar:D:\Programmi\Sun\jstudio_ent8\ide\enterprise1\modules\autoload\ext\jasper-compiler-5.5.7.jar:D:\Programmi\Sun\jstudio_ent8\ide\enterprise1\modules\autoload\ext\jasper-runtime-5.5.7.jar:D:\Programmi\Sun\jstudio_ent8\ide\enterprise1\modules\autoload\ext\commons-el.jar:D:\Programmi\Sun\jstudio_ent8\ide\ide5\modules\ext\commons-logging-1.0.4.jar:
                Setting project property: build.ear.classes.dir -> build/ear-module/WEB-INF/classes
                Setting project property: dist.javadoc.dir -> dist/javadoc
                Setting project property: src.dir -> src
                Setting project property: javac.classpath ->
                Setting project property: j2ee.platform -> 1.4
                Setting project property: javadoc.version -> false
                Setting project property: javadoc.windowtitle ->
                Setting project property: dist.war -> dist/TomcatServletExample.war
                Setting project property: javadoc.notree -> false
                Setting project property: dist.ear.war -> dist/TomcatServletExample.war
                -init-macrodef-property:
                +Datatype http://www.netbeans.org/ns/web-project/1:property org.apache.tools.ant.taskdefs.MacroInstance
                -do-ear-init:
                Skipped because property 'dist.ear.dir' not set.
                -do-init:
                Unable to find test
                Condition false; not setting have.tests
                Condition false; not setting netbeans.home+have.tests
                Condition false; not setting no.javadoc.preview
                Override ignored for property javac.compilerargs
                Property ${no.dependencies} has not been set
                Condition false; not setting no.deps
                Condition true; setting no.dist.ear.dir to true
                Setting project property: no.dist.ear.dir -> true
                Override ignored for property build.web.excludes
                Condition false; not setting do.compile.jsps
                Condition true; setting do.display.browser to true
                Setting project property: do.display.browser -> true
                Unable to find src\conf\MANIFEST.MF to set property has.custom.manifest
                Setting project property: build.meta.inf.dir -> build/web/META-INF
                Setting project property: build.classes.dir.real -> build/web/WEB-INF/classes
                Setting project property: build.web.dir.real -> build/web
                -post-init:
                -init-check:
                -init-macrodef-javac:
                +Datatype http://www.netbeans.org/ns/web-project/2:javac org.apache.tools.ant.taskdefs.MacroInstance
                -init-macrodef-junit:
                +Datatype http://www.netbeans.org/ns/web-project/2:junit org.apache.tools.ant.taskdefs.MacroInstance
                -init-macrodef-java:
                Property ${main.class} has not been set
                +Datatype http://www.netbeans.org/ns/web-project/1:java org.apache.tools.ant.taskdefs.MacroInstance
                -init-macrodef-nbjpda:
                Property ${main.class} has not been set
                +Datatype http://www.netbeans.org/ns/web-project/1:nbjpdastart org.apache.tools.ant.taskdefs.MacroInstance
                +Datatype http://www.netbeans.org/ns/web-project/1:nbjpdareload org.apache.tools.ant.taskdefs.MacroInstance
                -init-macrodef-debug:
                Property ${main.class} has not been set
                Property ${application.args} has not been set
                +Datatype http://www.netbeans.org/ns/web-project/1:debug org.apache.tools.ant.taskdefs.MacroInstance
                init:
                deps-module-jar:
                deps-ear-jar:
                Skipped because property 'dist.ear.dir' not set.
                deps-jar:
                -pre-pre-compile:
                -pre-compile:
                -copy-manifest:
                Skipped because property 'has.custom.manifest' not set.
                library-inclusion-in-archive:
                library-inclusion-in-manifest:
                Skipped because property 'dist.ear.dir' not set.
                -do-compile:
                Could not load a dependent class (com/sun/media/jai/codec/FileSeekableStream) for type image
                Could not load a dependent class (com/jcraft/jsch/UserInfo) for type sshexec
                Could not load a dependent class (com/jcraft/jsch/UserInfo) for type scp
                Could not load class (org.apache.tools.ant.tasksdefs.cvslib.CvsVersion) for type cvsversion
                Could not load a dependent class (jdepend/xmlui/JDepend) for type jdepend
                fileset: Setup scanner in dir C:\Documents and Settings\luca.C64\TomcatServletExample1\src with patternSet{ includes: [] excludes: [] }
                CookieExample.java omitted as CookieExample.class is up to date.
                HelloWorldExample.java omitted as HelloWorldExample.class is up to date.
                LocalStrings.properties skipped - don't know how to handle it
                LocalStrings_en.properties skipped - don't know how to handle it
                LocalStrings_es.properties skipped - don't know how to handle it
                LocalStrings_fr.properties skipped - don't know how to handle it
                RequestHeaderExample.java omitted as RequestHeaderExample.class is up to date.
                RequestInfoExample.java omitted as RequestInfoExample.class is up to date.
                RequestParamExample.java omitted as RequestParamExample.class is up to date.
                SessionExample.java omitted as SessionExample.class is up to date.
                compressionFilters\CompressionFilter.java omitted as compressionFilters/CompressionFilter.class is up to date.
                compressionFilters\CompressionFilterTestServlet.java omitted as compressionFilters/CompressionFilterTestServlet.class is up to date.
                compressionFilters\CompressionResponseStream.java omitted as compressionFilters/CompressionResponseStream.class is up to date.
                compressionFilters\CompressionServletResponseWrapper.java omitted as compressionFilters/CompressionServletResponseWrapper.class is up to date.
                filters\ExampleFilter.java omitted as filters/ExampleFilter.class is up to date.
                filters\RequestDumperFilter.java omitted as filters/RequestDumperFilter.class is up to date.
                filters\SetCharacterEncodingFilter.java omitted as filters/SetCharacterEncodingFilter.class is up to date.
                listeners\ContextListener.java omitted as listeners/ContextListener.class is up to date.
                listeners\SessionListener.java omitted as listeners/SessionListener.class is up to date.
                util\HTMLFilter.java omitted as util/HTMLFilter.class is up to date.
                fileset: Setup scanner in dir C:\Documents and Settings\luca.C64\TomcatServletExample1\src with patternSet{ includes: [] excludes: [**/*.java, **/*.form] }
                LocalStrings.properties omitted as LocalStrings.properties is up to date.
                LocalStrings_en.properties omitted as LocalStrings_en.properties is up to date.
                LocalStrings_es.properties omitted as LocalStrings_es.properties is up to date.
                LocalStrings_fr.properties omitted as LocalStrings_fr.properties is up to date.
                omitted as is up to date.
                compressionFilters omitted as compressionFilters is up to date.
                filters omitted as filters is up to date.
                listeners omitted as listeners is up to date.
                util omitted as util is up to date.
                fileset: Setup scanner in dir C:\Documents and Settings\luca.C64\TomcatServletExample1\web with patternSet{ includes: [] excludes: [**/*.java, **/*.form] }
                META-INF\context.xml omitted as META-INF/context.xml is up to date.
                WEB-INF\web.xml omitted as WEB-INF/web.xml is up to date.
                cookies.html omitted as cookies.html is up to date.
                helloworld.html omitted as helloworld.html is up to date.
                images\code.gif omitted as images/code.gif is up to date.
                images\execute.gif omitted as images/execute.gif is up to date.
                images\return.gif omitted as images/return.gif is up to date.
                index.html omitted as index.html is up to date.
                reqheaders.html omitted as reqheaders.html is up to date.
                reqinfo.html omitted as reqinfo.html is up to date.
                reqparams.html omitted as reqparams.html is up to date.
                sessions.html omitted as sessions.html is up to date.
                omitted as is up to date.
                META-INF omitted as META-INF is up to date.
                WEB-INF omitted as WEB-INF is up to date.
                images omitted as images is up to date.
                -post-compile:
                compile:
                compile-jsps:
                Skipped because property 'do.compile.jsps' not set.
                -do-compile-single-jsp:
                Skipped because property 'jsp.includes' not set.
                -pre-dist:
                -do-dist-with-manifest:
                Skipped because property 'has.custom.manifest' not set.
                -do-dist-without-manifest:
                Setting project property: dist.jar.dir -> C:\Documents and Settings\luca.C64\TomcatServletExample1\dist
                fileset: Setup scanner in dir C:\Documents and Settings\luca.C64\TomcatServletExample1\build\web with patternSet{ includes: [] excludes: [] }
                META-INF\context.xml omitted as META-INF/context.xml is up to date.
                WEB-INF\classes\CookieExample.class omitted as WEB-INF/classes/CookieExample.class is up to date.
                WEB-INF\classes\HelloWorldExample.class omitted as WEB-INF/classes/HelloWorldExample.class is up to date.
                WEB-INF\classes\LocalStrings.properties omitted as WEB-INF/classes/LocalStrings.properties is up to date.
                WEB-INF\classes\LocalStrings_en.properties omitted as WEB-INF/classes/LocalStrings_en.properties is up to date.
                WEB-INF\classes\LocalStrings_es.properties omitted as WEB-INF/classes/LocalStrings_es.properties is up to date.
                WEB-INF\classes\LocalStrings_fr.properties omitted as WEB-INF/classes/LocalStrings_fr.properties is up to date.
                WEB-INF\classes\RequestHeaderExample.class omitted as WEB-INF/classes/RequestHeaderExample.class is up to date.
                WEB-INF\classes\RequestInfoExample.class omitted as WEB-INF/classes/RequestInfoExample.class is up to date.
                WEB-INF\classes\RequestParamExample.class omitted as WEB-INF/classes/RequestParamExample.class is up to date.
                WEB-INF\classes\SessionExample.class omitted as WEB-INF/classes/SessionExample.class is up to date.
                WEB-INF\classes\compressionFilters\CompressionFilter.class omitted as WEB-INF/classes/compressionFilters/CompressionFilter.class is up to date.
                WEB-INF\classes\compressionFilters\CompressionFilterTestServlet.class omitted as WEB-INF/classes/compressionFilters/CompressionFilterTestServlet.class is up to date.
                WEB-INF\classes\compressionFilters\CompressionResponseStream.class omitted as WEB-INF/classes/compressionFilters/CompressionResponseStream.class is up to date.
                WEB-INF\classes\compressionFilters\CompressionServletResponseWrapper.class omitted as WEB-INF/classes/compressionFilters/CompressionServletResponseWrapper.class is up to date.
                WEB-INF\classes\filters\ExampleFilter.class omitted as WEB-INF/classes/filters/ExampleFilter.class is up to date.
                WEB-INF\classes\filters\RequestDumperFilter.class omitted as WEB-INF/classes/filters/RequestDumperFilter.class is up to date.
                WEB-INF\classes\filters\SetCharacterEncodingFilter.class omitted as WEB-INF/classes/filters/SetCharacterEncodingFilter.class is up to date.
                WEB-INF\classes\listeners\ContextListener.class omitted as WEB-INF/classes/listeners/ContextListener.class is up to date.
                WEB-INF\classes\listeners\SessionListener.class omitted as WEB-INF/classes/listeners/SessionListener.class is up to date.
                WEB-INF\classes\util\HTMLFilter.class omitted as WEB-INF/classes/util/HTMLFilter.class is up to date.
                WEB-INF\web.xml omitted as WEB-INF/web.xml is up to date.
                cookies.html omitted as cookies.html is up to date.
                helloworld.html omitted as helloworld.html is up to date.
                images\code.gif omitted as images/code.gif is up to date.
                images\execute.gif omitted as images/execute.gif is up to date.
                images\return.gif omitted as images/return.gif is up to date.
                index.html omitted as index.html is up to date.
                reqheaders.html omitted as reqheaders.html is up to date.
                reqinfo.html omitted as reqinfo.html is up to date.
                reqparams.html omitted as reqparams.html is up to date.
                sessions.html omitted as sessions.html is up to date.
                do-dist:
                -post-dist:
                dist:
                run-deploy:
                In-place deployment at C:\Documents and Settings\luca.C64\TomcatServletExample1\build\web
                Server returned HTTP response code: 403 for URL: http://localhost:8080/manager/deploy?config=file:/C:/DOCUME~1/luca.C64/IMPOST~1/Temp/context33857.xml&path=/TomcatServletExample1
                C:\Documents and Settings\luca.C64\TomcatServletExample1\nbproject\build-impl.xml:355: Deployment failed.
                at org.netbeans.modules.j2ee.ant.Deploy.execute(Deploy.java:85)
                at org.apache.tools.ant.UnknownElement.execute(UnknownElement.java:275)
                at org.apache.tools.ant.Task.perform(Task.java:364)
                at org.apache.tools.ant.Target.execute(Target.java:341)
                at org.apache.tools.ant.Target.performTasks(Target.java:369)
                at org.apache.tools.ant.Project.e
                • 5. Re: Strange Error when starting tomcat 5.5.7
                  807581
                  This looks like the same problem mentioned in:
                  http://lists.ibiblio.org/pipermail/dev-dpml/2004q4/000290.html

                  Can u check it out?
                  • 6. Re: Strange Error when starting tomcat 5.5.7
                    807581
                    Hello,

                    I read that email, and copied in lib a recent version of the jars of ant, without luck. The error i got then is the same, as shown below:

                    Stopping Tomcat process...
                    Tomcat server stopped.
                    Starting debug server Bundled Tomcat (5.5.7)
                    Tomcat server started.
                    In-place deployment at C:\Documents and Settings\luca.C64\TomcatServletExample1\build\web
                    deploy?config=file:/C:/DOCUME~1/luca.C64/IMPOST~1/Temp/context61504.xml&path=/TomcatServletExample1
                    Server returned HTTP response code: 403 for URL: http://localhost:8080/manager/deploy?config=file:/C:/DOCUME~1/luca.C64/IMPOST~1/Temp/context61504.xml&path=/TomcatServletExample1
                    C:\Documents and Settings\luca.C64\TomcatServletExample1\nbproject\build-impl.xml:373: Deployment failed.
                    at org.netbeans.modules.j2ee.ant.Deploy.execute(Deploy.java:85)
                    at org.apache.tools.ant.UnknownElement.execute(UnknownElement.java:276)
                    at sun.reflect.GeneratedMethodAccessor38.invoke(Unknown Source)
                    at sun.reflect.DelegatingMethodAccessorImpl.invoke(DelegatingMethodAccessorImpl.java:25)
                    at java.lang.reflect.Method.invoke(Method.java:585)
                    at org.apache.tools.ant.dispatch.DispatchUtils.execute(DispatchUtils.java:105)
                    at org.apache.tools.ant.Task.perform(Task.java:342)
                    at org.apache.tools.ant.Target.execute(Target.java:357)
                    at org.apache.tools.ant.Target.performTasks(Target.java:385)
                    at org.apache.tools.ant.Project.executeSortedTargets(Project.java:1282)
                    at org.apache.tools.ant.Project.executeTarget(Project.java:1251)
                    at org.apache.tools.ant.helper.DefaultExecutor.executeTargets(DefaultExecutor.java:41)
                    at org.apache.tools.ant.Project.executeTargets(Project.java:1134)
                    at org.apache.tools.ant.module.bridge.impl.BridgeImpl.run(BridgeImpl.java:234)
                    at org.apache.tools.ant.module.run.TargetExecutor.run(TargetExecutor.java:242)
                    at org.netbeans.core.execution.RunClassThread.run(RunClassThread.java:125)
                    Caused by: Deployment failed.
                    at org.netbeans.modules.j2ee.deployment.devmodules.api.Deployment.deploy(Deployment.java:151)
                    at org.netbeans.modules.j2ee.ant.Deploy.execute(Deploy.java:62)
                    ... 15 more
                    --- Nested Exception ---
                    Deployment failed.
                    at org.netbeans.modules.j2ee.deployment.devmodules.api.Deployment.deploy(Deployment.java:151)
                    at org.netbeans.modules.j2ee.ant.Deploy.execute(Deploy.java:62)
                    at org.apache.tools.ant.UnknownElement.execute(UnknownElement.java:276)
                    at sun.reflect.GeneratedMethodAccessor38.invoke(Unknown Source)
                    at sun.reflect.DelegatingMethodAccessorImpl.invoke(DelegatingMethodAccessorImpl.java:25)
                    at java.lang.reflect.Method.invoke(Method.java:585)
                    at org.apache.tools.ant.dispatch.DispatchUtils.execute(DispatchUtils.java:105)
                    at org.apache.tools.ant.Task.perform(Task.java:342)
                    at org.apache.tools.ant.Target.execute(Target.java:357)
                    at org.apache.tools.ant.Target.performTasks(Target.java:385)
                    at org.apache.tools.ant.Project.executeSortedTargets(Project.java:1282)
                    at org.apache.tools.ant.Project.executeTarget(Project.java:1251)
                    at org.apache.tools.ant.helper.DefaultExecutor.executeTargets(DefaultExecutor.java:41)
                    at org.apache.tools.ant.Project.executeTargets(Project.java:1134)
                    at org.apache.tools.ant.module.bridge.impl.BridgeImpl.run(BridgeImpl.java:234)
                    at org.apache.tools.ant.module.run.TargetExecutor.run(TargetExecutor.java:242)
                    at org.netbeans.core.execution.RunClassThread.run(RunClassThread.java:125)
                    BUILD FAILED (total time: 53 seconds)
                    Could not load class (org.apache.tools.ant.taskdefs.repository.MavenRepository) for type mavenrepository
                    Could not load a dependent class (jdepend/xmlui/JDepend) for type jdepend
                    Could not load a dependent class (com/jcraft/jsch/UserInfo) for type sshexec
                    Could not load a dependent class (javax/media/jai/PlanarImage) for type image
                    Could not load a dependent class (com/jcraft/jsch/UserInfo) for type scp
                    Could not load class (org.apache.tools.ant.taskdefs.repository.MavenRepository) for type mavenrepository
                    Could not load a dependent class (jdepend/xmlui/JDepend) for type jdepend
                    Could not load a dependent class (com/jcraft/jsch/UserInfo) for type sshexec
                    Could not load a dependent class (javax/media/jai/PlanarImage) for type image
                    Could not load a dependent class (com/jcraft/jsch/UserInfo) for type scp
                    • 7. Re: Strange Error when starting tomcat 5.5.7
                      807581
                      Not sure why this is happening... (Is there some other ant in the system classpath that may be interfering with the ide's ant...?)

                      Does 'build project' work without any problems? If so, then you can try exporting the war from the project, start the admin console for tomcat from the ide and try to manually deploy the war from the admin console and check tomcat log file... This might give some clue on why the deploy fails...