6 Replies Latest reply on Jul 16, 2012 5:53 PM by Vamseeg-Oracle

    Fusion Order Demo errors  server-setup-seed-deploy-test

    939861
      Hello everyone....I am new to SOA and new to this site as well. This is my first post. Facing a lot of hurdles deploying the FOD.

      I am stuck with errors at this point server-setup-seed-deploy-test. Can anyone of you be kind enough to guide me. Thank you.



      Buildfile: F:\stageFMW\DEMO_DOWNLOAD_HOME\11.1.1.6\CompositeServices\bin\build.xml
      [echo] Ant: Apache Ant version 1.7.1 compiled on June 27 2008 Java: 1.6
      [echo] Using mds-type : db
      [input] skipping input as property server.password has already been set.

      init:
      [echo] SOA Suite 11g version:
      [java]
      [java] *****************************************************************************
      [java] Oracle SOA Server version 11.1.1.6.0
      [java] Build: 0
      [java] Build time: Wed Dec 14 13:55:57 PST 2011
      [java] Build type: release
      [java] Source tag: PCBPEL_11.1.1.6.0_GENERIC_111214.0600.1553
      [java]
      [echo] soa infra mgmt home: F:\Oracle\Middleware\Jdeveloper\jdeveloper\

      server-setup-seed-deploy-test:
      [echo] Setting up mds store, deploying shared artifacts,
      seeding jms info, deploying to server, and running tests
      [echo] Ant: Apache Ant version 1.7.1 compiled on June 27 2008 Java: 1.6
      [echo] Using mds-type : db
      [input] skipping input as property server.password has already been set.

      init:
      [echo] SOA Suite 11g version:
      [java]
      [java] *****************************************************************************
      [java] Oracle SOA Server version 11.1.1.6.0
      [java] Build: 0
      [java] Build time: Wed Dec 14 13:55:57 PST 2011
      [java] Build type: release
      [java] Source tag: PCBPEL_11.1.1.6.0_GENERIC_111214.0600.1553
      [java]
      [echo] soa infra mgmt home: F:\Oracle\Middleware\Jdeveloper\jdeveloper\

      createMDSConnections:
      [echo] Ant: Apache Ant version 1.7.1 compiled on June 27 2008 Java: 1.6
      [echo] Using mds-type : db
      [input] skipping input as property server.password has already been set.

      createMDSConnectionForDB:
      [echo] Creating ../.adf/META-INF/adf-config.xml for database backed MDS
      [input] skipping input as property mds.db.password has already been set.
      [copy] Copying 1 file to F:\stageFMW\DEMO_DOWNLOAD_HOME\11.1.1.6\CompositeServices\.adf\META-INF
      [echo] Using jdbc:oracle:thin:@localhost:1521:xe for db-based backing, with user dev_mds
      [echo] Ant: Apache Ant version 1.7.1 compiled on June 27 2008 Java: 1.6
      [echo] Using mds-type : db
      [input] skipping input as property server.password has already been set.

      createMDSConnectionForFileStore:
      [echo] Ant: Apache Ant version 1.7.1 compiled on June 27 2008 Java: 1.6
      [echo] Using mds-type : db
      [input] skipping input as property server.password has already been set.

      createMDSConnectionForServerFileStore:

      importCommonServiceArtifactsIntoMds:
      [java] Starting local filesystem import into mds ..
      [java] 26-May-2012 00:53:46 oracle.mds
      [java] NOTIFICATION: PManager instance is created without multitenancy support as JVM flag "oracle.multitenant.enabled" is not set to enable multitenancy support.
      [java] Got target mds-instance: mstore-usage_1 from F:\stageFMW\DEMO_DOWNLOAD_HOME\11.1.1.6\CompositeServices\bin\..\.adf\META-INF\adf-config.xml
      [java] Creating mds connection to ./soa-seed/apps
      [java] --> F:\stageFMW\DEMO_DOWNLOAD_HOME\11.1.1.6\CompositeServices\bin\.\soa-seed
      [java] 26-May-2012 00:53:46 oracle.mds
      [java] NOTIFICATION: PManager instance is created without multitenancy support as JVM flag "oracle.multitenant.enabled" is not set to enable multitenancy support.
      [java] Local item: /apps/FusionOrderDemoShared/services/partnersupplier/Warehouse.xsd
      [java] Local item: /apps/FusionOrderDemoShared/services/orderbooking/OrderBookingProcessor.wsdl
      [java] Local item: /apps/FusionOrderDemoShared/services/creditAuthorization/CreditAuthorizationService.wsdl
      [java] Local item: /apps/FusionOrderDemoShared/services/oracle/fodemo/storefront/store/service/common/serviceinterface/StoreFrontService.xsd
      [java] Local item: /apps/FusionOrderDemoShared/policy/fault-bindings.xml
      [java] Local item: /apps/FusionOrderDemoShared/services/oracle/fodemo/storefront/store/queries/common/CustomerInfoVOSDO.xsd
      [java] Local item: /apps/FusionOrderDemoShared/services/partnersupplier/PartnerSupplierComposite.wsdl
      [java] Local item: /apps/FusionOrderDemoShared/policy/fault-policies.xml
      [java] Local item: /apps/FusionOrderDemoShared/services/oracle/fodemo/storefront/store/service/common/serviceinterface/StoreFrontService.wsdl
      [java] Local item: /apps/FusionOrderDemoShared/services/oracle/fodemo/storefront/store/queries/common/OrderInfoVOSDO.xsd
      [java] Local item: /apps/FusionOrderDemoShared/services/orderbooking/OrderProcessor.xsd
      [java] Local item: /apps/FusionOrderDemoShared/services/creditAuthorization/creditauthorization.xsd
      [java] Local item: /apps/FusionOrderDemoShared/services/oracle/fodemo/storefront/entities/events/OrderEO.xsd
      [java] Local item: /apps/FusionOrderDemoShared/services/oracle/fodemo/storefront/entities/events/OrderEO.edl
      [java] Local item: /apps/FusionOrderDemoShared/services/oracle/fodemo/storefront/store/queries/common/OrderItemsInfoVOSDO.xsd
      [java] Now transferring ..
      [java] 26-May-2012 00:53:46 oracle.mds
      [java] NOTIFICATION: import operation started.
      [java] 26-May-2012 00:53:46 oracle.mds
      [java] NOTIFICATION: import is completed. Total number of documents successfully processed : 15, total number of documents failed : 0.
      [java] Transferred size = 15
      [java] Transferred - /apps/FusionOrderDemoShared/policy/fault-bindings.xml
      [java] Transferred - /apps/FusionOrderDemoShared/policy/fault-policies.xml
      [java] Transferred - /apps/FusionOrderDemoShared/services/partnersupplier/Warehouse.xsd
      [java] Transferred - /apps/FusionOrderDemoShared/services/orderbooking/OrderProcessor.xsd
      [java] Transferred - /apps/FusionOrderDemoShared/services/orderbooking/OrderBookingProcessor.wsdl
      [java] Transferred - /apps/FusionOrderDemoShared/services/creditAuthorization/creditauthorization.xsd
      [java] Transferred - /apps/FusionOrderDemoShared/services/partnersupplier/PartnerSupplierComposite.wsdl
      [java] Transferred - /apps/FusionOrderDemoShared/services/creditAuthorization/CreditAuthorizationService.wsdl
      [java] Transferred - /apps/FusionOrderDemoShared/services/oracle/fodemo/storefront/entities/events/OrderEO.xsd
      [java] Transferred - /apps/FusionOrderDemoShared/services/oracle/fodemo/storefront/entities/events/OrderEO.edl
      [java] Transferred - /apps/FusionOrderDemoShared/services/oracle/fodemo/storefront/store/queries/common/OrderInfoVOSDO.xsd
      [java] Transferred - /apps/FusionOrderDemoShared/services/oracle/fodemo/storefront/store/queries/common/CustomerInfoVOSDO.xsd
      [java] Transferred - /apps/FusionOrderDemoShared/services/oracle/fodemo/storefront/store/queries/common/OrderItemsInfoVOSDO.xsd
      [java] Transferred - /apps/FusionOrderDemoShared/services/oracle/fodemo/storefront/store/service/common/serviceinterface/StoreFrontService.xsd
      [java] Transferred - /apps/FusionOrderDemoShared/services/oracle/fodemo/storefront/store/service/common/serviceinterface/StoreFrontService.wsdl
      [echo] Ant: Apache Ant version 1.7.1 compiled on June 27 2008 Java: 1.6
      [echo] Using mds-type : db
      [input] skipping input as property server.password has already been set.

      createSOAPartitionIfNotExist:
      [echo] oracle.home = F:\Oracle\Middleware\Jdeveloper\jdeveloper\

      listPartitions:
      [input] skipping input as property platform has already been set.
      [input] skipping input as property host has already been set.
      [input] skipping input as property port has already been set.
      [input] skipping input as property user has already been set.
      [secure-input] skipping secure-input as property password has already been set.
      [echo] oracle.home = F:\Oracle\Middleware\Jdeveloper\jdeveloper\

      folderMgrTask:
      [java] calling FolderManager.initConnection(), m_platform= weblogic, m_host=localhost, m_port=7001, m_user=weblogic
      [java] Connecting to: service:jmx:t3://localhost:7001/jndi/weblogic.management.mbeanservers.runtime
      [java] connection initiated
      [java] folderMBean=oracle.soa.config:name=soa-infra,j2eeType=FolderLifecycleConfig,Application=soa-infra
      [java] Following 2 partitions are currently available on the platform:
      [java]
      [java] 1. default
      [java] 2. soaFusionOrderDemo
      [java]
      [echo] Creating partition soaFusionOrderDemo? ${createPartition}
      [echo] Ant: Apache Ant version 1.7.1 compiled on June 27 2008 Java: 1.6
      [echo] Using mds-type : db
      [input] skipping input as property server.password has already been set.

      doCreatePartition:
      [delete] Deleting: F:\stageFMW\DEMO_DOWNLOAD_HOME\11.1.1.6\CompositeServices\bin\partitionList.dat
      [echo] Ant: Apache Ant version 1.7.1 compiled on June 27 2008 Java: 1.6
      [echo] Using mds-type : db
      [input] skipping input as property server.password has already been set.

      init:
      [echo] SOA Suite 11g version:
      [java]
      [java] *****************************************************************************
      [java] Oracle SOA Server version 11.1.1.6.0
      [java] Build: 0
      [java] Build time: Wed Dec 14 13:55:57 PST 2011
      [java] Build type: release
      [java] Source tag: PCBPEL_11.1.1.6.0_GENERIC_111214.0600.1553
      [java]
      [echo] soa infra mgmt home: F:\Oracle\Middleware\Jdeveloper\jdeveloper\

      compile-build-all:
      [echo] Building and compiling SOA Fusion Order Demo ..

      clean:
      [echo] Cleanup of OrderApprovalHumanTask
      [delete] Deleting: F:\stageFMW\DEMO_DOWNLOAD_HOME\11.1.1.6\CompositeServices\OrderApprovalHumanTask\deploy\OrderApprovalHumanTask.war
      [delete] Deleting: F:\stageFMW\DEMO_DOWNLOAD_HOME\11.1.1.6\CompositeServices\OrderApprovalHumanTask\deploy\OrderApprovalHumanTask.ear

      init:

      compile:
      [javac] Compiling 6 source files to F:\stageFMW\DEMO_DOWNLOAD_HOME\11.1.1.6\CompositeServices\OrderApprovalHumanTask\public_html\WEB-INF\classes

      copy:
      [copy] Copying 191 files to F:\stageFMW\DEMO_DOWNLOAD_HOME\11.1.1.6\CompositeServices\OrderApprovalHumanTask\public_html\WEB-INF\classes

      create-ear:
      [copy] Copying 4 files to F:\stageFMW\DEMO_DOWNLOAD_HOME\11.1.1.6\CompositeServices\OrderApprovalHumanTask\public_html\WEB-INF\lib
      [war] Building war: F:\stageFMW\DEMO_DOWNLOAD_HOME\11.1.1.6\CompositeServices\OrderApprovalHumanTask\deploy\OrderApprovalHumanTask.war
      [delete] Deleting directory F:\stageFMW\DEMO_DOWNLOAD_HOME\11.1.1.6\CompositeServices\OrderApprovalHumanTask\public_html\WEB-INF\lib

      setupDeploymentEnvironment:
      [echo] Step1: copy template ./templates/connections.xml.seed to ../../.adf/META-INF/connections.xml
      [copy] Copying 1 file to F:\stageFMW\DEMO_DOWNLOAD_HOME\11.1.1.6\CompositeServices\.adf\META-INF
      [echo] Step2: setup descriptor, soa-only? false, modifying ../../.adf/META-INF/connections.xml
      [echo] replacing ws-endpoint with localhost:7001/StoreFrontServiceHooks/StoreFrontService
      [echo] replacing ws-binding with {www.globalcompany.example.com}StoreFrontServiceSoapHttp
      [mkdir] Created dir: F:\stageFMW\DEMO_DOWNLOAD_HOME\11.1.1.6\CompositeServices\OrderApprovalHumanTask\deploy\adf\META-INF
      [copy] Copying 2 files to F:\stageFMW\DEMO_DOWNLOAD_HOME\11.1.1.6\CompositeServices\OrderApprovalHumanTask\deploy\adf\META-INF
      [echo] Creating custom adf config for customization of connections.xml - datasource: jdbc/mds/MDS_LocalTxDataSource
      [mkdir] Created dir: F:\stageFMW\DEMO_DOWNLOAD_HOME\11.1.1.6\CompositeServices\OrderApprovalHumanTask\deploy\lib
      [copy] Copying 1 file to F:\stageFMW\DEMO_DOWNLOAD_HOME\11.1.1.6\CompositeServices\OrderApprovalHumanTask\deploy\lib
      [ear] Building ear: F:\stageFMW\DEMO_DOWNLOAD_HOME\11.1.1.6\CompositeServices\OrderApprovalHumanTask\deploy\OrderApprovalHumanTask.ear
      [delete] Deleting directory F:\stageFMW\DEMO_DOWNLOAD_HOME\11.1.1.6\CompositeServices\OrderApprovalHumanTask\deploy\adf
      [delete] Deleting directory F:\stageFMW\DEMO_DOWNLOAD_HOME\11.1.1.6\CompositeServices\OrderApprovalHumanTask\deploy\lib

      create-deployable-composite:
      [echo] oracle.home = F:\Oracle\Middleware\Jdeveloper\jdeveloper\
      [input] skipping input as property compositeDir has already been set.
      [input] skipping input as property compositeName has already been set.
      [input] skipping input as property revision has already been set.

      clean:
      [echo] deleting F:\stageFMW\DEMO_DOWNLOAD_HOME\11.1.1.6\CompositeServices\OrderBookingComposite\bin/..//deploy/sca_OrderBookingComposite_rev1.0.jar
      [delete] Deleting: F:\stageFMW\DEMO_DOWNLOAD_HOME\11.1.1.6\CompositeServices\OrderBookingComposite\deploy\sca_OrderBookingComposite_rev1.0.jar

      init:

      scac-validate:
      [echo] Running scac-validate in F:\stageFMW\DEMO_DOWNLOAD_HOME\11.1.1.6\CompositeServices\OrderBookingComposite\bin/..//composite.xml
      [echo] oracle.home = F:\Oracle\Middleware\Jdeveloper\jdeveloper\
      [input] skipping input as property compositeDir has already been set.
      [input] skipping input as property compositeName has already been set.
      [input] skipping input as property revision has already been set.

      scac:
      [scac] Validating composite "F:\stageFMW\DEMO_DOWNLOAD_HOME\11.1.1.6\CompositeServices\OrderBookingComposite\bin/..//composite.xml"
      [scac] F:\stageFMW\DEMO_DOWNLOAD_HOME\11.1.1.6\CompositeServices\OrderBookingComposite\bin/..//composite.xml:170: warning: Failed to Find Binding "CreditCardAuthorizationService":"{http://www.globalcompany.example.com/ns/CreditAuthorizationService}CreditAuthorizationPort" in WSDL Manager
      [scac] F:\stageFMW\DEMO_DOWNLOAD_HOME\11.1.1.6\CompositeServices\OrderBookingComposite\bin/..//composite.xml:163: warning: Failed to Find Binding "PartnerSupplierService":"{http://www.partnersupplier.example.com/ns/warehouse}ExternalPartnerSupplier_pt" in WSDL Manager
      [scac] F:\stageFMW\DEMO_DOWNLOAD_HOME\11.1.1.6\CompositeServices\OrderBookingComposite\bin/..//composite.xml:180: warning: Failed to Find Binding "StoreFrontService":"{www.globalcompany.example.com}StoreFrontServiceSoapHttpPort" in WSDL Manager
      [scac] OrderProcessor.bpel:223: warning: <from> value type "{http://www.w3.org/2001/XMLSchema}long" is not compatible with <to> value type "{http://www.w3.org/2001/XMLSchema}string"
      [scac] OrderProcessor.bpel:310: warning: <from> value type "{http://www.w3.org/2001/XMLSchema}decimal" is not compatible with <to> value type "{http://www.w3.org/2001/XMLSchema}string"
      [scac] OrderProcessor.bpel:310: warning: <from> value type "{http://www.w3.org/2001/XMLSchema}integer" is not compatible with <to> value type "{http://www.w3.org/2001/XMLSchema}string"
      [scac] OrderProcessor.bpel:390: warning: <from> value type "{http://www.w3.org/2001/XMLSchema}decimal" is not compatible with <to> value type "{http://www.w3.org/2001/XMLSchema}double"
      [scac] OrderProcessor.bpel:390: warning: <from> value type "{http://www.w3.org/2001/XMLSchema}string" is not compatible with <to> value type "{http://www.w3.org/2001/XMLSchema}boolean"
      [scac] OrderProcessor.bpel:429: warning: <from> value type "{http://www.w3.org/2001/XMLSchema}boolean" is not compatible with <to> value type "{http://www.w3.org/2001/XMLSchema}string"
      [scac] OrderProcessor.bpel:571: warning: <from> value type "{http://www.w3.org/2001/XMLSchema}integer" is not compatible with <to> value type "{http://www.w3.org/2001/XMLSchema}string"
      [scac] >>>>>>>>>>>>>>>>>>>>>>>>>>>>>>>>>>>>>>>>>>>>>>
      [scac] >> modified xmlbean locale class in use
      [scac] >>>>>>>>>>>>>>>>>>>>>>>>>>>>>>>>>>>>>>>>>>>>>>

      package:
      [echo] oracle.home = F:\Oracle\Middleware\Jdeveloper\jdeveloper\
      [input] skipping input as property compositeDir has already been set.
      [input] skipping input as property compositeName has already been set.
      [input] skipping input as property revision has already been set.

      compile-source:
      [mkdir] Created dir: F:\stageFMW\DEMO_DOWNLOAD_HOME\11.1.1.6\CompositeServices\OrderBookingComposite\dist
      [copy] Copying 142 files to F:\stageFMW\DEMO_DOWNLOAD_HOME\11.1.1.6\CompositeServices\OrderBookingComposite\dist
      [copy] Warning: F:\stageFMW\DEMO_DOWNLOAD_HOME\11.1.1.6\CompositeServices\OrderBookingComposite\src not found.
      [copy] Warning: F:\stageFMW\DEMO_DOWNLOAD_HOME\11.1.1.6\CompositeServices\OrderBookingComposite\SCA-INF\src not found.
      [copy] Copying 6 files to F:\stageFMW\DEMO_DOWNLOAD_HOME\11.1.1.6\CompositeServices\OrderBookingComposite\dist\SCA-INF\classes
      [jar] Building jar: F:\stageFMW\DEMO_DOWNLOAD_HOME\11.1.1.6\CompositeServices\OrderBookingComposite\deploy\sca_OrderBookingComposite_rev1.0.jar
      [delete] Deleting directory F:\stageFMW\DEMO_DOWNLOAD_HOME\11.1.1.6\CompositeServices\OrderBookingComposite\dist

      setupDeploymentEnvironment:
      [copy] Copying 1 file to F:\stageFMW\DEMO_DOWNLOAD_HOME\11.1.1.6\CompositeServices\OrderBookingComposite\bin
      [echo] Setting up deployment plan, modifying orderbooking_deployment_plan.xml
      [echo] Replacing ws-endpoint with localhost:7001/StoreFrontServiceHooks/StoreFrontService
      [echo] Replacing soa server and wls server information
      [echo] -SOA: localhost 7001
      [echo] Replacing file adapter endpoint with /tmp
      [echo] Disabling global bam sensors? false
      [echo] Amending jndi destination for jms topic jms/DemoSupplierTopicUdd
      [echo] Replacing soa partition name with soaFusionOrderDemo
      [echo] Replacing values for bam connection in connections.xml
      [echo] Bam server host: localhost
      [echo] Bam server host: 9001
      [echo] Bam server user: weblogic
      [echo] Spring lib path: F:\Oracle\Middleware\Jdeveloper\jdeveloper\/../oracle_common/modules/org.springframework_2.5.jar

      compile-classes:

      create-deployable-composite:
      [echo] oracle.home = F:\Oracle\Middleware\Jdeveloper\jdeveloper\
      [input] skipping input as property compositeDir has already been set.
      [input] skipping input as property compositeName has already been set.
      [input] skipping input as property revision has already been set.

      clean:
      [echo] deleting F:\stageFMW\DEMO_DOWNLOAD_HOME\11.1.1.6\CompositeServices\PartnerSupplierComposite\bin/..//deploy/sca_PartnerSupplierComposite_rev1.0.jar
      [delete] Deleting: F:\stageFMW\DEMO_DOWNLOAD_HOME\11.1.1.6\CompositeServices\PartnerSupplierComposite\deploy\sca_PartnerSupplierComposite_rev1.0.jar

      init:

      scac-validate:
      [echo] Running scac-validate in F:\stageFMW\DEMO_DOWNLOAD_HOME\11.1.1.6\CompositeServices\PartnerSupplierComposite\bin/..//composite.xml
      [echo] oracle.home = F:\Oracle\Middleware\Jdeveloper\jdeveloper\
      [input] skipping input as property compositeDir has already been set.
      [input] skipping input as property compositeName has already been set.
      [input] skipping input as property revision has already been set.

      scac:
      [scac] Validating composite "F:\stageFMW\DEMO_DOWNLOAD_HOME\11.1.1.6\CompositeServices\PartnerSupplierComposite\bin/..//composite.xml"
      [scac] PartnerSupplierMediator.mplan: warning: Case "ExternalPartnerSupplier.externalpartnersupplier_client.process" doesnt have any payload transformation Please make sure source and target message part name are same and of same type. Otherwise, target reference may fail to execute with error message like "Input sourcelike Null" or "Part not found"
      [scac] >>>>>>>>>>>>>>>>>>>>>>>>>>>>>>>>>>>>>>>>>>>>>>
      [scac] >> modified xmlbean locale class in use
      [scac] >>>>>>>>>>>>>>>>>>>>>>>>>>>>>>>>>>>>>>>>>>>>>>

      package:
      [echo] oracle.home = F:\Oracle\Middleware\Jdeveloper\jdeveloper\
      [input] skipping input as property compositeDir has already been set.
      [input] skipping input as property compositeName has already been set.
      [input] skipping input as property revision has already been set.

      compile-source:
      [echo] deleting .class files of F:\stageFMW\DEMO_DOWNLOAD_HOME\11.1.1.6\CompositeServices\PartnerSupplierComposite\bin/..//SCA-INF/classes
      [javac] Compiling 18 source files to F:\stageFMW\DEMO_DOWNLOAD_HOME\11.1.1.6\CompositeServices\PartnerSupplierComposite\SCA-INF\classes
      [javac] Note: Some input files use unchecked or unsafe operations.
      [javac] Note: Recompile with -Xlint:unchecked for details.
      [mkdir] Created dir: F:\stageFMW\DEMO_DOWNLOAD_HOME\11.1.1.6\CompositeServices\PartnerSupplierComposite\dist
      [copy] Copying 68 files to F:\stageFMW\DEMO_DOWNLOAD_HOME\11.1.1.6\CompositeServices\PartnerSupplierComposite\dist
      [copy] Warning: F:\stageFMW\DEMO_DOWNLOAD_HOME\11.1.1.6\CompositeServices\PartnerSupplierComposite\SCA-INF\src not found.
      [copy] Copying 6 files to F:\stageFMW\DEMO_DOWNLOAD_HOME\11.1.1.6\CompositeServices\PartnerSupplierComposite\dist\SCA-INF\classes
      [jar] Building jar: F:\stageFMW\DEMO_DOWNLOAD_HOME\11.1.1.6\CompositeServices\PartnerSupplierComposite\deploy\sca_PartnerSupplierComposite_rev1.0.jar
      [delete] Deleting directory F:\stageFMW\DEMO_DOWNLOAD_HOME\11.1.1.6\CompositeServices\PartnerSupplierComposite\dist
      [echo] Spring lib path: F:\Oracle\Middleware\Jdeveloper\jdeveloper\/../oracle_common/modules/org.springframework_2.5.jar

      setupDeploymentEnvironment:
      [copy] Copying 1 file to F:\stageFMW\DEMO_DOWNLOAD_HOME\11.1.1.6\CompositeServices\PartnerSupplierComposite\bin
      [echo] Setting up deployment plan, modifying PartnerSupplierComposite_cfgplan.xml
      [echo] Replacing ejb-name with WebLogicFusionOrderDemo-ExternalLegacyPartnerSupplierJScaEjb
      [echo] Replacing file adapter endpoint with /tmp/quote

      create-deployable-composite:
      [echo] oracle.home = F:\Oracle\Middleware\Jdeveloper\jdeveloper\
      [input] skipping input as property compositeDir has already been set.
      [input] skipping input as property compositeName has already been set.
      [input] skipping input as property revision has already been set.

      clean:
      [echo] deleting F:\stageFMW\DEMO_DOWNLOAD_HOME\11.1.1.6\CompositeServices\OrderSDOComposite\bin/..//deploy/sca_OrderSDOComposite_rev1.0.jar
      [delete] Deleting: F:\stageFMW\DEMO_DOWNLOAD_HOME\11.1.1.6\CompositeServices\OrderSDOComposite\deploy\sca_OrderSDOComposite_rev1.0.jar

      init:

      scac-validate:
      [echo] Running scac-validate in F:\stageFMW\DEMO_DOWNLOAD_HOME\11.1.1.6\CompositeServices\OrderSDOComposite\bin/..//composite.xml
      [echo] oracle.home = F:\Oracle\Middleware\Jdeveloper\jdeveloper\
      [input] skipping input as property compositeDir has already been set.
      [input] skipping input as property compositeName has already been set.
      [input] skipping input as property revision has already been set.

      scac:
      [scac] Validating composite "F:\stageFMW\DEMO_DOWNLOAD_HOME\11.1.1.6\CompositeServices\OrderSDOComposite\bin/..//composite.xml"
      [scac] CustomerAndOrderService.bpel:254: warning: <from> value type "{http://www.w3.org/2001/XMLSchema}anySimpleType" is not compatible with <to> value type "{http://www.w3.org/2001/XMLSchema}integer"
      [scac] CustomerAndOrderService.bpel:359: warning: <from> value type "{http://www.w3.org/2001/XMLSchema}integer" is not compatible with <to> value type "{http://www.w3.org/2001/XMLSchema}long"
      [scac] CustomerAndOrderService.bpel:493: warning: <from> value type "{http://www.w3.org/2001/XMLSchema}integer" is not compatible with <to> value type "{http://www.w3.org/2001/XMLSchema}long"

      package:
      [echo] oracle.home = F:\Oracle\Middleware\Jdeveloper\jdeveloper\
      [input] skipping input as property compositeDir has already been set.
      [input] skipping input as property compositeName has already been set.
      [input] skipping input as property revision has already been set.

      compile-source:
      [mkdir] Created dir: F:\stageFMW\DEMO_DOWNLOAD_HOME\11.1.1.6\CompositeServices\OrderSDOComposite\dist
      [copy] Copying 12 files to F:\stageFMW\DEMO_DOWNLOAD_HOME\11.1.1.6\CompositeServices\OrderSDOComposite\dist
      [copy] Warning: F:\stageFMW\DEMO_DOWNLOAD_HOME\11.1.1.6\CompositeServices\OrderSDOComposite\src not found.
      [copy] Warning: F:\stageFMW\DEMO_DOWNLOAD_HOME\11.1.1.6\CompositeServices\OrderSDOComposite\SCA-INF\src not found.
      [copy] Copying 6 files to F:\stageFMW\DEMO_DOWNLOAD_HOME\11.1.1.6\CompositeServices\OrderSDOComposite\dist\SCA-INF\classes
      [jar] Building jar: F:\stageFMW\DEMO_DOWNLOAD_HOME\11.1.1.6\CompositeServices\OrderSDOComposite\deploy\sca_OrderSDOComposite_rev1.0.jar
      [delete] Deleting directory F:\stageFMW\DEMO_DOWNLOAD_HOME\11.1.1.6\CompositeServices\OrderSDOComposite\dist
        • 1. Re: Fusion Order Demo errors  server-setup-seed-deploy-test
          939861
          continued........................


          create-deployable-composite:
          [echo] oracle.home = F:\Oracle\Middleware\Jdeveloper\jdeveloper\
          [input] skipping input as property compositeDir has already been set.
          [input] skipping input as property compositeName has already been set.
          [input] skipping input as property revision has already been set.

          clean:
          [echo] deleting F:\stageFMW\DEMO_DOWNLOAD_HOME\11.1.1.6\CompositeServices\B2BX12OrderGateway\bin/..//deploy/sca_B2BX12OrderGateway_rev1.0.jar
          [delete] Deleting: F:\stageFMW\DEMO_DOWNLOAD_HOME\11.1.1.6\CompositeServices\B2BX12OrderGateway\deploy\sca_B2BX12OrderGateway_rev1.0.jar

          init:

          scac-validate:
          [echo] Running scac-validate in F:\stageFMW\DEMO_DOWNLOAD_HOME\11.1.1.6\CompositeServices\B2BX12OrderGateway\bin/..//composite.xml
          [echo] oracle.home = F:\Oracle\Middleware\Jdeveloper\jdeveloper\
          [input] skipping input as property compositeDir has already been set.
          [input] skipping input as property compositeName has already been set.
          [input] skipping input as property revision has already been set.

          scac:
          [scac] Validating composite "F:\stageFMW\DEMO_DOWNLOAD_HOME\11.1.1.6\CompositeServices\B2BX12OrderGateway\bin/..//composite.xml"
          [scac] F:\stageFMW\DEMO_DOWNLOAD_HOME\11.1.1.6\CompositeServices\B2BX12OrderGateway\bin/..//composite.xml:48: warning: Failed to Find Binding "StoreFrontService":"{www.globalcompany.example.com}StoreFrontServiceSoapHttpPort" in WSDL Manager
          [scac] F:\stageFMW\DEMO_DOWNLOAD_HOME\11.1.1.6\CompositeServices\B2BX12OrderGateway\bin/..//composite.xml:59: warning: Failed to Find Binding "OrderBookingService":"{http://www.globalcompany.example.com/ns/OrderBookingService}OrderProcessor_pt" in WSDL Manager
          [scac] B2BOrderProcessingEngine.componentType: warning: property "bpel.config.use.events" may not be understood by BPEL component B2BOrderProcessingEngine - it will likely be ignored.
          [scac] B2BOrderProcessingEngine.bpel:188: warning: <from> value type "{http://www.w3.org/2001/XMLSchema}integer" is not compatible with <to> value type "{http://www.w3.org/2001/XMLSchema}string"

          package:
          [echo] oracle.home = F:\Oracle\Middleware\Jdeveloper\jdeveloper\
          [input] skipping input as property compositeDir has already been set.
          [input] skipping input as property compositeName has already been set.
          [input] skipping input as property revision has already been set.

          compile-source:
          [mkdir] Created dir: F:\stageFMW\DEMO_DOWNLOAD_HOME\11.1.1.6\CompositeServices\B2BX12OrderGateway\dist
          [copy] Copying 25 files to F:\stageFMW\DEMO_DOWNLOAD_HOME\11.1.1.6\CompositeServices\B2BX12OrderGateway\dist
          [copy] Warning: F:\stageFMW\DEMO_DOWNLOAD_HOME\11.1.1.6\CompositeServices\B2BX12OrderGateway\src not found.
          [copy] Warning: F:\stageFMW\DEMO_DOWNLOAD_HOME\11.1.1.6\CompositeServices\B2BX12OrderGateway\SCA-INF\src not found.
          [copy] Copying 6 files to F:\stageFMW\DEMO_DOWNLOAD_HOME\11.1.1.6\CompositeServices\B2BX12OrderGateway\dist\SCA-INF\classes
          [jar] Building jar: F:\stageFMW\DEMO_DOWNLOAD_HOME\11.1.1.6\CompositeServices\B2BX12OrderGateway\deploy\sca_B2BX12OrderGateway_rev1.0.jar
          [delete] Deleting directory F:\stageFMW\DEMO_DOWNLOAD_HOME\11.1.1.6\CompositeServices\B2BX12OrderGateway\dist

          setupDeploymentEnvironment:
          [copy] Copying 1 file to F:\stageFMW\DEMO_DOWNLOAD_HOME\11.1.1.6\CompositeServices\B2BX12OrderGateway\bin
          [echo] Setting up deployment plan, modifying B2BX12OrderGateway_deployment_plan.xml
          [echo] Replacing ws-endpoint with localhost:7001/StoreFrontServiceHooks/StoreFrontService
          [echo] Replacing soa server and wls server information
          [echo] -SOA: localhost 7001
          [echo] Replacing communication style, eventbased? true
          [echo] Replacing soa partition name with soaFusionOrderDemo
          [echo] Wls home: F:\Oracle\Middleware\Jdeveloper\jdeveloper\/../wlserver_10.3
          [echo] Oracle home: F:\Oracle\Middleware\Jdeveloper\jdeveloper\

          init:

          compile:

          create-war:
          [echo] Deploying jsca shared lib? true
          [echo] Wls home: F:\Oracle\Middleware\Jdeveloper\jdeveloper\/../wlserver_10.3
          [echo] Oracle home: F:\Oracle\Middleware\Jdeveloper\jdeveloper\

          create-ear:
          [echo] global: true > ejb: ${use.ejb} jsca: true
          [echo] Deploying jsca shared lib? true
          [echo] Wls home: F:\Oracle\Middleware\Jdeveloper\jdeveloper\/../wlserver_10.3
          [echo] Oracle home: F:\Oracle\Middleware\Jdeveloper\jdeveloper\

          clean:
          [echo] Cleaning up external partner supplier ejb project ../classes/../deploy
          [delete] Deleting: F:\stageFMW\DEMO_DOWNLOAD_HOME\11.1.1.6\CompositeServices\ExternalLegacyPartnerSupplierEjb\deploy\ExternalPartnerSupplierEjb.ear
          [echo] Deploying jsca shared lib? true
          [echo] Wls home: F:\Oracle\Middleware\Jdeveloper\jdeveloper\/../wlserver_10.3
          [echo] Oracle home: F:\Oracle\Middleware\Jdeveloper\jdeveloper\

          init:

          copy:
          [copy] Copying 5 files to F:\stageFMW\DEMO_DOWNLOAD_HOME\11.1.1.6\CompositeServices\ExternalLegacyPartnerSupplierEjb\classes

          compile:
          [javac] Compiling 6 source files to F:\stageFMW\DEMO_DOWNLOAD_HOME\11.1.1.6\CompositeServices\ExternalLegacyPartnerSupplierEjb\classes
          [javac] Note: F:\stageFMW\DEMO_DOWNLOAD_HOME\11.1.1.6\CompositeServices\ExternalLegacyPartnerSupplierEjb\src\com\otn\sample\fod\soa\externalps\test\EpsSessionEJBClient.java uses unchecked or unsafe operations.
          [javac] Note: Recompile with -Xlint:unchecked for details.

          create-ejb-ear:
          [echo] Deploying jsca shared lib? true
          [echo] Wls home: F:\Oracle\Middleware\Jdeveloper\jdeveloper\/../wlserver_10.3
          [echo] Oracle home: F:\Oracle\Middleware\Jdeveloper\jdeveloper\

          init:

          copy:

          compile:

          create-jsca-ear:
          [mkdir] Created dir: F:\stageFMW\DEMO_DOWNLOAD_HOME\11.1.1.6\CompositeServices\ExternalLegacyPartnerSupplierEjb\deploy\APP-INF\lib
          [copy] Copying 1 file to F:\stageFMW\DEMO_DOWNLOAD_HOME\11.1.1.6\CompositeServices\ExternalLegacyPartnerSupplierEjb\deploy\APP-INF\lib
          [echo] ../classes/meta-inf/
          [jar] Building jar: F:\stageFMW\DEMO_DOWNLOAD_HOME\11.1.1.6\CompositeServices\ExternalLegacyPartnerSupplierEjb\deploy\APP-INF\lib\ExternalPartnerSupplierScaModule.jar
          [jar] Building MANIFEST-only jar: F:\stageFMW\DEMO_DOWNLOAD_HOME\11.1.1.6\CompositeServices\ExternalLegacyPartnerSupplierEjb\deploy\empty.jar
          [ear] Building ear: F:\stageFMW\DEMO_DOWNLOAD_HOME\11.1.1.6\CompositeServices\ExternalLegacyPartnerSupplierEjb\deploy\ExternalPartnerSupplierEjb.ear

          compile-deploy-all:
          [echo] Deploying SOA Fusion Order Demo ..
          [echo] Deploying jsca shared lib? true
          [echo] Wls home: F:\Oracle\Middleware\Jdeveloper\jdeveloper\/../wlserver_10.3
          [echo] Oracle home: F:\Oracle\Middleware\Jdeveloper\jdeveloper\

          deploy-application:
          [echo] Deploying jsca shared lib? true
          [echo] Wls home: F:\Oracle\Middleware\Jdeveloper\jdeveloper\/../wlserver_10.3
          [echo] Oracle home: F:\Oracle\Middleware\Jdeveloper\jdeveloper\

          deploy-jsca-library:
          [wldeploy] weblogic.Deployer -remote -noexit -name weblogic-sca -source F:\Oracle\Middleware\wlserver_10.3\common\deployable-libraries\weblogic-sca-1.1.war -targets AdminServer -adminurl t3://localhost:7001 -user weblogic -password ******** -deploy -library
          [wldeploy] weblogic.Deployer invoked with options: -remote -noexit -name weblogic-sca -source F:\Oracle\Middleware\wlserver_10.3\common\deployable-libraries\weblogic-sca-1.1.war -targets AdminServer -adminurl t3://localhost:7001 -user weblogic -deploy -library
          [wldeploy] <26-May-2012 00:54:30 o'clock BST> <Info> <J2EE Deployment SPI> <BEA-260121> <Initiating deploy operation for application, weblogic-sca [archive: F:\Oracle\Middleware\wlserver_10.3\common\deployable-libraries\weblogic-sca-1.1.war], to AdminServer .>
          [wldeploy] weblogic.Deployer -remote -upload -noexit -name ExternalPartnerSupplierEjb -source F:\stageFMW\DEMO_DOWNLOAD_HOME\11.1.1.6\CompositeServices\ExternalLegacyPartnerSupplierEjb\deploy\ExternalPartnerSupplierEjb.ear -targets AdminServer -adminurl t3://localhost:7001 -user weblogic -password ******** -deploy
          [wldeploy] weblogic.Deployer invoked with options: -remote -upload -noexit -name ExternalPartnerSupplierEjb -source F:\stageFMW\DEMO_DOWNLOAD_HOME\11.1.1.6\CompositeServices\ExternalLegacyPartnerSupplierEjb\deploy\ExternalPartnerSupplierEjb.ear -targets AdminServer -adminurl t3://localhost:7001 -user weblogic -deploy
          [wldeploy] <26-May-2012 00:54:32 o'clock BST> <Info> <J2EE Deployment SPI> <BEA-260121> <Initiating deploy operation for application, ExternalPartnerSupplierEjb [archive: F:\stageFMW\DEMO_DOWNLOAD_HOME\11.1.1.6\CompositeServices\ExternalLegacyPartnerSupplierEjb\deploy\ExternalPartnerSupplierEjb.ear], to AdminServer .>
          [wldeploy] Task 24 initiated: [Deployer:149026]deploy application ExternalPartnerSupplierEjb on AdminServer.
          [wldeploy] Task 24 completed: [Deployer:149026]deploy application ExternalPartnerSupplierEjb on AdminServer.

          [wldeploy] Target state: deploy completed on Server AdminServer

          [wldeploy]
          deploy-composite:

          attachplan:
          [input] skipping input as property scac.sar has already been set.
          [input] skipping input as property scac.plan has already been set.
          [attachplan] attachPlan: Started for Composite SAR file = ../OrderBookingComposite/deploy/sca_OrderBookingComposite_rev1.0.jar using deploy plan = F:\stageFMW\DEMO_DOWNLOAD_HOME\11.1.1.6\CompositeServices\OrderBookingComposite\bin/orderbooking_deployment_plan.xml
          [attachplan] Load deployment plan file F:\stageFMW\DEMO_DOWNLOAD_HOME\11.1.1.6\CompositeServices\OrderBookingComposite\bin/orderbooking_deployment_plan.xml
          [attachplan] Done Load deployment plan file F:\stageFMW\DEMO_DOWNLOAD_HOME\11.1.1.6\CompositeServices\OrderBookingComposite\bin/orderbooking_deployment_plan.xml
          [attachplan] Unpacking the Composite SAR to tmp folder F:\DOCUME~1\ADMINI~1\LOCALS~1\Temp\soaear_14030.tmp
          [attachplan] Copy new plan file orderbooking_deployment_plan.xml to F:\DOCUME~1\ADMINI~1\LOCALS~1\Temp\soaear_14030.tmp\soaconfigplan.xml
          [attachplan] Repacking F:\stageFMW\DEMO_DOWNLOAD_HOME\11.1.1.6\CompositeServices\bin\..\OrderBookingComposite\deploy\sca_OrderBookingComposite_rev1.0.jar file soaconfigplan.xml
          [attachplan] Deleting tmp composite sar folder ...F:\DOCUME~1\ADMINI~1\LOCALS~1\Temp\soaear_14030.tmp
          [attachplan] Attach plan successful
          [echo] Deploying to http://localhost:7001/soa-infra/deployer
          [echo] oracle.home = F:\Oracle\Middleware\Jdeveloper\jdeveloper\

          deploy:
          [input] skipping input as property serverURL has already been set.
          [input] skipping input as property sarLocation has already been set.
          [input] skipping input as property password has already been set.
          [deployComposite] setting user/password..., user=weblogic
          [deployComposite] Processing sar=../OrderBookingComposite/deploy/sca_OrderBookingComposite_rev1.0.jar
          [deployComposite] Adding sar file - F:\stageFMW\DEMO_DOWNLOAD_HOME\11.1.1.6\CompositeServices\bin\..\OrderBookingComposite\deploy\sca_OrderBookingComposite_rev1.0.jar
          [deployComposite] INFO: Creating HTTP connection to host:localhost, port:7001
          [deployComposite] INFO: Received HTTP response from the server, response code=200
          [deployComposite] ---->Deploying composite success.
          [delete] Deleting: F:\stageFMW\DEMO_DOWNLOAD_HOME\11.1.1.6\CompositeServices\OrderBookingComposite\bin\deployResult.dat

          createBAMConfig:
          [copy] Copying 15 files to F:\Oracle\Middleware\Jdeveloper\jdeveloper\bam\dataObjects

          seedBAMServerObjects:
          [java] Oracle BAM Command Utility [Build 16732, BAM Repository Version 2025] Copyright © 2002, 2011, Oracle and/or its affiliates. All rights reserved.
          [java] Exception in thread "main" java.lang.NoClassDefFoundError: org/apache/commons/codec/binary/Base64
          [java]      at oracle.bam.common.cryptography.Cryptor.decrypt(Cryptor.java:102)
          [java]      at oracle.bam.icommand.ConsoleController.readConfigPassword(ConsoleController.java:308)
          [java]      at oracle.bam.icommand.ConsoleController.resolvePassword(ConsoleController.java:263)
          [java]      at oracle.bam.middleware.icommandengine.Controller.go(Controller.java:214)
          [java]      at oracle.bam.middleware.icommandengine.Controller.go(Controller.java:186)
          [java]      at oracle.bam.icommand.ConsoleController.go(ConsoleController.java:183)
          [java]      at oracle.bam.icommand.Application.main(Application.java:56)
          [java] Caused by: java.lang.ClassNotFoundException: org.apache.commons.codec.binary.Base64
          [java]      at java.net.URLClassLoader$1.run(URLClassLoader.java:202)
          [java]      at java.security.AccessController.doPrivileged(Native Method)
          [java]      at java.net.URLClassLoader.findClass(URLClassLoader.java:190)
          [java]      at java.lang.ClassLoader.loadClass(ClassLoader.java:305)
          [java]      at sun.misc.Launcher$AppClassLoader.loadClass(Launcher.java:301)
          [java]      at java.lang.ClassLoader.loadClass(ClassLoader.java:246)
          [java]      ... 7 more
          [java] Java Result: 1

          seedBAMAdapterResources:
          [echo] Seeding bam adapter connection factory for fusion order demo (F:\stageFMW\DEMO_DOWNLOAD_HOME\11.1.1.6\CompositeServices\OrderBookingComposite\bin)
          [copy] Copying 1 file to F:\stageFMW\DEMO_DOWNLOAD_HOME\11.1.1.6\CompositeServices\OrderBookingComposite\bin
          [copy] Copying 1 file to F:\stageFMW\DEMO_DOWNLOAD_HOME\11.1.1.6\CompositeServices\OrderBookingComposite\bin
          [java]
          [java] Initializing WebLogic Scripting Tool (WLST) ...
          [java]
          [java] Welcome to WebLogic Server Administration Scripting Shell
          [java]
          [java] Type help() for help on available commands
          [java]
          [java] Starting modification of BAM resource adapter connection factory ..
          [java] Connecting to t3://localhost:7001 with userid weblogic ...
          [java] Successfully connected to Admin Server 'AdminServer' that belongs to domain 'dev_domain'.
          [java]
          [java] Warning: An insecure protocol was used to connect to the
          [java] server. To ensure on-the-wire security, the SSL port or
          [java] Admin port should be used instead.
          [java]
          [java] Configuring OracleBamAdapter - amending connection factory info for eis/bam/rmi and eis/bam/soap
          [java] Redeploying application OracleBamAdapter ...
          [java] <26-May-2012 00:54:57 o'clock BST> <Info> <J2EE Deployment SPI> <BEA-260121> <Initiating redeploy operation for application, OracleBamAdapter [archive: null], to AdminServer .>
          [java] .....................Completed the redeployment of Application with status completed
          [java] Current Status of your Deployment:
          [java] Deployment command type: redeploy
          [java] Deployment State : completed
          [java] Deployment Message : no message
          [java] <26-May-2012 00:56:00 o'clock BST> <Warning> <JNDI> <BEA-050001> <WLContext.close() was called in a different thread than the one in which it was created.>
          [delete] Deleting: F:\stageFMW\DEMO_DOWNLOAD_HOME\11.1.1.6\CompositeServices\OrderBookingComposite\bin\createBamResourceAdapterCF.py
          [delete] Deleting: F:\stageFMW\DEMO_DOWNLOAD_HOME\11.1.1.6\CompositeServices\OrderBookingComposite\bin\BamAdapterDeploymentPlan_1337990090265.xml
          [echo] Spring lib path: F:\Oracle\Middleware\Jdeveloper\jdeveloper\/../oracle_common/modules/org.springframework_2.5.jar

          deploy-composite:

          attachplan:
          [input] skipping input as property scac.sar has already been set.
          [input] skipping input as property scac.plan has already been set.
          [attachplan] attachPlan: Started for Composite SAR file = ../PartnerSupplierComposite/deploy/sca_PartnerSupplierComposite_rev1.0.jar using deploy plan = F:\stageFMW\DEMO_DOWNLOAD_HOME\11.1.1.6\CompositeServices\PartnerSupplierComposite\bin/PartnerSupplierComposite_cfgplan.xml
          [attachplan] Load deployment plan file F:\stageFMW\DEMO_DOWNLOAD_HOME\11.1.1.6\CompositeServices\PartnerSupplierComposite\bin/PartnerSupplierComposite_cfgplan.xml
          [attachplan] Done Load deployment plan file F:\stageFMW\DEMO_DOWNLOAD_HOME\11.1.1.6\CompositeServices\PartnerSupplierComposite\bin/PartnerSupplierComposite_cfgplan.xml
          [attachplan] Unpacking the Composite SAR to tmp folder F:\DOCUME~1\ADMINI~1\LOCALS~1\Temp\soaear_31767.tmp
          [attachplan] Copy new plan file PartnerSupplierComposite_cfgplan.xml to F:\DOCUME~1\ADMINI~1\LOCALS~1\Temp\soaear_31767.tmp\soaconfigplan.xml
          [attachplan] Repacking F:\stageFMW\DEMO_DOWNLOAD_HOME\11.1.1.6\CompositeServices\bin\..\PartnerSupplierComposite\deploy\sca_PartnerSupplierComposite_rev1.0.jar file soaconfigplan.xml
          [attachplan] Deleting tmp composite sar folder ...F:\DOCUME~1\ADMINI~1\LOCALS~1\Temp\soaear_31767.tmp
          [attachplan] Attach plan successful
          [echo] Deploying to http://localhost:7001/soa-infra/deployer
          [echo] oracle.home = F:\Oracle\Middleware\Jdeveloper\jdeveloper\

          deploy:
          [input] skipping input as property serverURL has already been set.
          [input] skipping input as property sarLocation has already been set.
          [input] skipping input as property password has already been set.
          [deployComposite] setting user/password..., user=weblogic
          [deployComposite] Processing sar=../PartnerSupplierComposite/deploy/sca_PartnerSupplierComposite_rev1.0.jar
          [deployComposite] Adding sar file - F:\stageFMW\DEMO_DOWNLOAD_HOME\11.1.1.6\CompositeServices\bin\..\PartnerSupplierComposite\deploy\sca_PartnerSupplierComposite_rev1.0.jar
          [deployComposite] INFO: Creating HTTP connection to host:localhost, port:7001
          [deployComposite] INFO: Received HTTP response from the server, response code=200
          [deployComposite] ---->Deploying composite success.
          [delete] Deleting: F:\stageFMW\DEMO_DOWNLOAD_HOME\11.1.1.6\CompositeServices\PartnerSupplierComposite\bin\deployResult.dat

          deploy-composite:
          [echo] Deploying to http://localhost:7001/soa-infra/deployer
          [echo] oracle.home = F:\Oracle\Middleware\Jdeveloper\jdeveloper\

          deploy:
          [input] skipping input as property serverURL has already been set.
          [input] skipping input as property sarLocation has already been set.
          [input] skipping input as property password has already been set.
          [deployComposite] setting user/password..., user=weblogic
          [deployComposite] Processing sar=../OrderSDOComposite/deploy/sca_OrderSDOComposite_rev1.0.jar
          [deployComposite] Adding sar file - F:\stageFMW\DEMO_DOWNLOAD_HOME\11.1.1.6\CompositeServices\bin\..\OrderSDOComposite\deploy\sca_OrderSDOComposite_rev1.0.jar
          [deployComposite] INFO: Creating HTTP connection to host:localhost, port:7001
          [deployComposite] INFO: Received HTTP response from the server, response code=200
          [deployComposite] ---->Deploying composite success.
          [delete] Deleting: F:\stageFMW\DEMO_DOWNLOAD_HOME\11.1.1.6\CompositeServices\OrderSDOComposite\bin\deployResult.dat

          deploy-composite:

          attachplan:
          [input] skipping input as property scac.sar has already been set.
          [input] skipping input as property scac.plan has already been set.
          [attachplan] attachPlan: Started for Composite SAR file = ../B2BX12OrderGateway/deploy/sca_B2BX12OrderGateway_rev1.0.jar using deploy plan = F:\stageFMW\DEMO_DOWNLOAD_HOME\11.1.1.6\CompositeServices\B2BX12OrderGateway\bin/B2BX12OrderGateway_deployment_plan.xml
          [attachplan] Load deployment plan file F:\stageFMW\DEMO_DOWNLOAD_HOME\11.1.1.6\CompositeServices\B2BX12OrderGateway\bin/B2BX12OrderGateway_deployment_plan.xml
          [attachplan] Done Load deployment plan file F:\stageFMW\DEMO_DOWNLOAD_HOME\11.1.1.6\CompositeServices\B2BX12OrderGateway\bin/B2BX12OrderGateway_deployment_plan.xml
          [attachplan] Unpacking the Composite SAR to tmp folder F:\DOCUME~1\ADMINI~1\LOCALS~1\Temp\soaear_42498.tmp
          [attachplan] Copy new plan file B2BX12OrderGateway_deployment_plan.xml to F:\DOCUME~1\ADMINI~1\LOCALS~1\Temp\soaear_42498.tmp\soaconfigplan.xml
          [attachplan] Repacking F:\stageFMW\DEMO_DOWNLOAD_HOME\11.1.1.6\CompositeServices\bin\..\B2BX12OrderGateway\deploy\sca_B2BX12OrderGateway_rev1.0.jar file soaconfigplan.xml
          [attachplan] Deleting tmp composite sar folder ...F:\DOCUME~1\ADMINI~1\LOCALS~1\Temp\soaear_42498.tmp
          [attachplan] Attach plan successful
          [echo] Deploying to http://localhost:7001/soa-infra/deployer
          [echo] oracle.home = F:\Oracle\Middleware\Jdeveloper\jdeveloper\

          deploy:
          [input] skipping input as property serverURL has already been set.
          [input] skipping input as property sarLocation has already been set.
          [input] skipping input as property password has already been set.
          [deployComposite] setting user/password..., user=weblogic
          [deployComposite] Processing sar=../B2BX12OrderGateway/deploy/sca_B2BX12OrderGateway_rev1.0.jar
          [deployComposite] Adding sar file - F:\stageFMW\DEMO_DOWNLOAD_HOME\11.1.1.6\CompositeServices\bin\..\B2BX12OrderGateway\deploy\sca_B2BX12OrderGateway_rev1.0.jar
          [deployComposite] INFO: Creating HTTP connection to host:localhost, port:7001
          [deployComposite] INFO: Received HTTP response from the server, response code=200
          [deployComposite] ---->Deploying composite success.
          [delete] Deleting: F:\stageFMW\DEMO_DOWNLOAD_HOME\11.1.1.6\CompositeServices\B2BX12OrderGateway\bin\deployResult.dat

          importAndDeployB2BTradingAgreements:
          [echo] Importing and deploying b2b trading partner agreements
          [java] Commandline arguments 2: [import, ../config/OOW08_X12_10.zip]
          [java] Import with overwrite=false
          [java] *** Import operation completed successfully ***
          [java] Time elapsed:7703ms
          [java] Commandline arguments 1: [deploy]
          [java] *** Deployment operation completed successfully ***
          [java] Time elapsed:1500ms
          [java] Commandline arguments 1: [restartb2b]
          [java] Time elapsed:1094ms
          [delete] Deleting: F:\stageFMW\DEMO_DOWNLOAD_HOME\11.1.1.6\CompositeServices\B2BX12OrderGateway\bin\jndi.properties
          [echo] Wls home: F:\Oracle\Middleware\Jdeveloper\jdeveloper\/../wlserver_10.3
          [echo] Oracle home: F:\Oracle\Middleware\Jdeveloper\jdeveloper\
          • 2. Re: Fusion Order Demo errors  server-setup-seed-deploy-test
            939861
            continued......................

            deploy-application:
            [wldeploy] weblogic.Deployer -remote -upload -noexit -name WebServices_WebLogicFusionOrderDemo_CreditCardAuthorization -source F:\stageFMW\DEMO_DOWNLOAD_HOME\11.1.1.6\CompositeServices\CreditCardAuthorization\deploy\WebServices_WebLogicFusionOrderDemo_CreditCardAuthorization.war -targets AdminServer -adminurl t3://localhost:7001 -user weblogic -password ******** -deploy
            [wldeploy] weblogic.Deployer invoked with options: -remote -upload -noexit -name WebServices_WebLogicFusionOrderDemo_CreditCardAuthorization -source F:\stageFMW\DEMO_DOWNLOAD_HOME\11.1.1.6\CompositeServices\CreditCardAuthorization\deploy\WebServices_WebLogicFusionOrderDemo_CreditCardAuthorization.war -targets AdminServer -adminurl t3://localhost:7001 -user weblogic -deploy
            [wldeploy] <26-May-2012 00:56:49 o'clock BST> <Info> <J2EE Deployment SPI> <BEA-260121> <Initiating deploy operation for application, WebServices_WebLogicFusionOrderDemo_CreditCardAuthorization [archive: F:\stageFMW\DEMO_DOWNLOAD_HOME\11.1.1.6\CompositeServices\CreditCardAuthorization\deploy\WebServices_WebLogicFusionOrderDemo_CreditCardAuthorization.war], to AdminServer .>
            [wldeploy] Task 26 initiated: [Deployer:149026]deploy application WebServices_WebLogicFusionOrderDemo_CreditCardAuthorization on AdminServer.
            [wldeploy] Task 26 completed: [Deployer:149026]deploy application WebServices_WebLogicFusionOrderDemo_CreditCardAuthorization on AdminServer.

            [wldeploy] Target state: deploy completed on Server AdminServer

            [wldeploy]


            deploy-application:
            [wldeploy] weblogic.Deployer -remote -upload -noexit -name OrderApprovalHumanTask -source F:\stageFMW\DEMO_DOWNLOAD_HOME\11.1.1.6\CompositeServices\OrderApprovalHumanTask\deploy\OrderApprovalHumanTask.ear -targets AdminServer -adminurl t3://localhost:7001 -user weblogic -password ******** -deploy
            [wldeploy] weblogic.Deployer invoked with options: -remote -upload -noexit -name OrderApprovalHumanTask -source F:\stageFMW\DEMO_DOWNLOAD_HOME\11.1.1.6\CompositeServices\OrderApprovalHumanTask\deploy\OrderApprovalHumanTask.ear -targets AdminServer -adminurl t3://localhost:7001 -user weblogic -deploy
            [wldeploy] <26-May-2012 00:56:52 o'clock BST> <Info> <J2EE Deployment SPI> <BEA-260121> <Initiating deploy operation for application, OrderApprovalHumanTask [archive: F:\stageFMW\DEMO_DOWNLOAD_HOME\11.1.1.6\CompositeServices\OrderApprovalHumanTask\deploy\OrderApprovalHumanTask.ear], to AdminServer .>
            [wldeploy] Task 27 initiated: [Deployer:149026]deploy application OrderApprovalHumanTask on AdminServer.
            [wldeploy] Task 27 completed: [Deployer:149026]deploy application OrderApprovalHumanTask on AdminServer.

            [wldeploy] Target state: deploy completed on Server AdminServer

            [wldeploy]

            [echo] Ant: Apache Ant version 1.7.1 compiled on June 27 2008 Java: 1.6
            [echo] Using mds-type : db
            [input] skipping input as property server.password has already been set.

            init:
            [echo] SOA Suite 11g version:
            [java]
            [java] *****************************************************************************
            [java] Oracle SOA Server version 11.1.1.6.0
            [java] Build: 0
            [java] Build time: Wed Dec 14 13:55:57 PST 2011
            [java] Build type: release
            [java] Source tag: PCBPEL_11.1.1.6.0_GENERIC_111214.0600.1553
            [java]
            [echo] soa infra mgmt home: F:\Oracle\Middleware\Jdeveloper\jdeveloper\

            seedFodJmsResources:
            [echo] Seeding jms topic and connection factory for fusion order demo
            [copy] Copying 1 file to F:\stageFMW\DEMO_DOWNLOAD_HOME\11.1.1.6\CompositeServices\bin
            [copy] Copying 1 file to F:\stageFMW\DEMO_DOWNLOAD_HOME\11.1.1.6\CompositeServices\bin
            [java]
            [java] Initializing WebLogic Scripting Tool (WLST) ...
            [java]
            [java] Welcome to WebLogic Server Administration Scripting Shell
            [java]
            [java] Type help() for help on available commands
            [java]
            [java] Starting creation of JMS resources ..
            [java] Connecting to t3://localhost:7001 with userid weblogic ...
            [java] Successfully connected to Admin Server 'AdminServer' that belongs to domain 'dev_domain'.
            [java]
            [java] Warning: An insecure protocol was used to connect to the
            [java] server. To ensure on-the-wire security, the SSL port or
            [java] Admin port should be used instead.
            [java]
            [java] Location changed to edit tree. This is a writable tree with
            [java] DomainMBean as the root. To make changes you will need to start
            [java] an edit session via startEdit().
            [java]
            [java] For more help, use help(edit)
            [java]
            [java] Starting an edit session ...
            [java] Started edit session, please be sure to save and activate your
            [java] changes once you are done.
            [java] Found DemoSupplierTopicCF connection factory - noop
            [java] Found DemoSupplierTopic_UDD topic - noop
            [java] Saving all your changes ...
            [java] Saved all your changes successfully.
            [java] Activating all your changes, this may take a while ...
            [java] The edit lock associated with this edit session is released
            [java] once the activation is completed.
            [java] Activation completed
            [java] jms topic and factory for SOA Fusion Order Demo successfully created
            [java] Creating jms adapter connection factory information
            [java] Redeploying application JmsAdapter ...
            [java] <26-May-2012 00:57:19 o'clock BST> <Info> <J2EE Deployment SPI> <BEA-260121> <Initiating redeploy operation for application, JmsAdapter [archive: null], to AdminServer .>
            [java] .Completed the redeployment of Application with status completed
            [java] Current Status of your Deployment:
            [java] Deployment command type: redeploy
            [java] Deployment State : completed
            [java] Deployment Message : no message
            [java] <26-May-2012 00:57:22 o'clock BST> <Warning> <JNDI> <BEA-050001> <WLContext.close() was called in a different thread than the one in which it was created.>
            [delete] Deleting: F:\stageFMW\DEMO_DOWNLOAD_HOME\11.1.1.6\CompositeServices\bin\createJMSResources.py
            [delete] Deleting: F:\stageFMW\DEMO_DOWNLOAD_HOME\11.1.1.6\CompositeServices\bin\JmsAdapterDeploymentPlan_1337990228796.xml
            [echo] Ant: Apache Ant version 1.7.1 compiled on June 27 2008 Java: 1.6
            [echo] Using mds-type : db
            [input] skipping input as property server.password has already been set.

            init:
            [echo] SOA Suite 11g version:
            [java]
            [java] *****************************************************************************
            [java] Oracle SOA Server version 11.1.1.6.0
            [java] Build: 0
            [java] Build time: Wed Dec 14 13:55:57 PST 2011
            [java] Build type: release
            [java] Source tag: PCBPEL_11.1.1.6.0_GENERIC_111214.0600.1553
            [java]
            [echo] soa infra mgmt home: F:\Oracle\Middleware\Jdeveloper\jdeveloper\

            seedFodFileAdapterResources:
            [echo] Seeding file adapter connection factory for fusion order demo
            [copy] Copying 1 file to F:\stageFMW\DEMO_DOWNLOAD_HOME\11.1.1.6\CompositeServices\bin
            [copy] Copying 1 file to F:\stageFMW\DEMO_DOWNLOAD_HOME\11.1.1.6\CompositeServices\bin
            [java]
            [java] Initializing WebLogic Scripting Tool (WLST) ...
            [java]
            [java] Welcome to WebLogic Server Administration Scripting Shell
            [java]
            [java] Type help() for help on available commands
            [java]
            [java] Starting creation of File adapter resources ..
            [java] Connecting to t3://localhost:7001 with userid weblogic ...
            [java] Successfully connected to Admin Server 'AdminServer' that belongs to domain 'dev_domain'.
            [java]
            [java] Warning: An insecure protocol was used to connect to the
            [java] server. To ensure on-the-wire security, the SSL port or
            [java] Admin port should be used instead.
            [java]
            [java] Redeploying application FileAdapter ...
            [java] <26-May-2012 00:57:30 o'clock BST> <Info> <J2EE Deployment SPI> <BEA-260121> <Initiating redeploy operation for application, FileAdapter [archive: null], to AdminServer .>
            [java] .Completed the redeployment of Application with status completed
            [java] Current Status of your Deployment:
            [java] Deployment command type: redeploy
            [java] Deployment State : completed
            [java] Deployment Message : no message
            [java] <26-May-2012 00:57:33 o'clock BST> <Warning> <JNDI> <BEA-050001> <WLContext.close() was called in a different thread than the one in which it was created.>
            [delete] Deleting: F:\stageFMW\DEMO_DOWNLOAD_HOME\11.1.1.6\CompositeServices\bin\createFileAdapterResources.py
            [delete] Deleting: F:\stageFMW\DEMO_DOWNLOAD_HOME\11.1.1.6\CompositeServices\bin\FileAdapterDeploymentPlan_1337990243156.xml
            [echo] Ant: Apache Ant version 1.7.1 compiled on June 27 2008 Java: 1.6
            [echo] Using mds-type : db
            [input] skipping input as property server.password has already been set.

            seedDemoUsers:
            [echo] t3://localhost:7001
            [wldeploy] weblogic.Deployer -remote -upload -noexit -name SOATestDemoApp -source F:\stageFMW\DEMO_DOWNLOAD_HOME\11.1.1.6\CompositeServices\bin\bpm-seed\SOATestDemoApp.ear -targets AdminServer -adminurl t3://localhost:7001 -user weblogic -password ******** -deploy
            [wldeploy] weblogic.Deployer invoked with options: -remote -upload -noexit -name SOATestDemoApp -source F:\stageFMW\DEMO_DOWNLOAD_HOME\11.1.1.6\CompositeServices\bin\bpm-seed\SOATestDemoApp.ear -targets AdminServer -adminurl t3://localhost:7001 -user weblogic -deploy
            [wldeploy] <26-May-2012 00:57:35 o'clock BST> <Info> <J2EE Deployment SPI> <BEA-260121> <Initiating deploy operation for application, SOATestDemoApp [archive: F:\stageFMW\DEMO_DOWNLOAD_HOME\11.1.1.6\CompositeServices\bin\bpm-seed\SOATestDemoApp.ear], to AdminServer .>
            [wldeploy] Task 30 initiated: [Deployer:149026]deploy application SOATestDemoApp on AdminServer.
            [wldeploy] Task 30 completed: [Deployer:149026]deploy application SOATestDemoApp on AdminServer.

            [wldeploy] Target state: deploy completed on Server AdminServer

            [wldeploy]
            • 3. Re: Fusion Order Demo errors  server-setup-seed-deploy-test
              939861
              continued.....

              [echo] Server URL: http://localhost:7001 F:\Oracle\Middleware\Jdeveloper\jdeveloper\
              [java] ****************************************************************************
              [java] * Oracle SOA Demo Community Seeding *
              [java] * *
              [java] * Usage : java oracle.bpel.services.identity.demoseed.DemoCommunitySeed \ *
              [java] * [-serverURL http://HOST:PORT] [-inputFile inputfile.xml] \ *
              [java] * [-action SEED_COMMUNITY | REMOVE_COMMUNITY] *
              [java] * *
              [java] * Default values : *
              [java] * serverUrl : http://localhost:7001 *
              [java] * inputFile : default-demo-community.xml *
              [java] * action : SEED_COMMUNITY *
              [java] ****************************************************************************
              [java] URL : http://localhost:7001/integration/SOADemoCommunity/DemoCommunitySeedServlet
              [java] <html>
              [java] <head>
              [java] <title>Demo User Community</title>
              [java] <link rel="stylesheet" type="text/css" href="stylesheet.css"/>
              [java] </head>
              [java] <body>
              [java] <h1>User/Group Seeding</h1>
              [java] Creating Users :
              [java] demoadmin
              [java] cdickens
              [java] wfaulk
              [java] sfitzger
              [java] jstein
              [java] istone
              [java] jcooper
              [java] mtwain
              [java] jlondon
              [java] ltolstoy
              [java] fkafka
              [java] szweig
              [java] mmitch
              [java] jausten
              [java] achrist
              [java] rsteven
              [java] cdoyle
              [java] wshake
              [java] Groups :
              [java] Supervisor
              [java] LoanAnalyticGroup
              [java] LoanAgentGroup
              [java] California
              [java] WesternRegion
              [java] EasternRegion
              [java] CentralRegion
              [java] RegionalOffices
              [java] </body>
              [java] </html>
              [echo] Ant: Apache Ant version 1.7.1 compiled on June 27 2008 Java: 1.6
              [echo] Using mds-type : db
              [input] skipping input as property server.password has already been set.

              init:
              [echo] SOA Suite 11g version:
              [java]
              [java] *****************************************************************************
              [java] Oracle SOA Server version 11.1.1.6.0
              [java] Build: 0
              [java] Build time: Wed Dec 14 13:55:57 PST 2011
              [java] Build type: release
              [java] Source tag: PCBPEL_11.1.1.6.0_GENERIC_111214.0600.1553
              [java]
              [echo] soa infra mgmt home: F:\Oracle\Middleware\Jdeveloper\jdeveloper\

              build-ws-client:
              [clientgen]
              *********** jax-ws clientgen attribute settings ***************

              wsdlURI: http://localhost:7001/soa-infra/services/soaFusionOrderDemo/OrderBookingComposite!1.0/orderprocessor_client_ep?wsdl
              packageName : null
              destDir : F:\stageFMW\DEMO_DOWNLOAD_HOME\11.1.1.6\CompositeServices\bin\util\classes

              *********** jax-ws clientgen attribute settings end ***************

              [clientgen] Consider using <depends>/<produces> so that wsimport won't do unnecessary compilation
              [clientgen] parsing WSDL...
              [clientgen]
              [clientgen]
              [clientgen] generating code...
              [clientgen]
              [clientgen]
              [clientgen] compiling code...
              [clientgen]

              test-fod-composite-end2end:
              [echo] Wls home: F:\Oracle\Middleware\Jdeveloper\jdeveloper\/../wlserver_10.3
              [echo] Oracle home: F:\Oracle\Middleware\Jdeveloper\jdeveloper\

              init:

              compile:

              test-webservice:
              [java] wsdl location: http://localhost:7001/WebServices_WebLogicFusionOrderDemo_CreditCardAuthorization/CreditAuthorizationPort?wsdl
              [java] Status: APPROVED
              [echo] Deploying jsca shared lib? true
              [echo] Wls home: F:\Oracle\Middleware\Jdeveloper\jdeveloper\/../wlserver_10.3
              [echo] Oracle home: F:\Oracle\Middleware\Jdeveloper\jdeveloper\

              init:

              compile:

              test-remote-ejb:
              [java] Loading props from: F:\stageFMW\DEMO_DOWNLOAD_HOME\11.1.1.6\CompositeServices\ExternalLegacyPartnerSupplierEjb\..\bin\build.properties
              [java] Testing jsca ctx: WebLogicFusionOrderDemo-ExternalLegacyPartnerSupplierJScaEjb
              [java] Price: 50.0
              [java] got expected exception: Cannot use item, is of type: java.lang.String, must be of type: com.otn.sample.fod.soa.externalps.OrderItem
              [echo] Spring lib path: F:\Oracle\Middleware\Jdeveloper\jdeveloper\/../oracle_common/modules/org.springframework_2.5.jar

              compile-classes:

              test-spring-classes:
              [copy] Copying 1 file to F:\stageFMW\DEMO_DOWNLOAD_HOME\11.1.1.6\CompositeServices\PartnerSupplierComposite\SCA-INF\classes
              [echo] Testing ejb binding injection based on: WebLogicFusionOrderDemo-ExternalLegacyPartnerSupplierJScaEjb
              [java] 26-May-2012 00:57:45 org.springframework.context.support.AbstractApplicationContext prepareRefresh
              [java] INFO: Refreshing org.springframework.context.support.ClassPathXmlApplicationContext@1c247ad: display name [org.springframework.context.support.ClassPathXmlApplicationContext@1c247ad]; startup date [Sat May 26 00:57:45 BST 2012]; root of context hierarchy
              [java] 26-May-2012 00:57:46 org.springframework.beans.factory.xml.XmlBeanDefinitionReader loadBeanDefinitions
              [java] INFO: Loading XML bean definitions from class path resource [test-spring-context.xml]
              [java] 26-May-2012 00:57:46 org.springframework.context.support.AbstractApplicationContext obtainFreshBeanFactory
              [java] INFO: Bean factory for application context [org.springframework.context.support.ClassPathXmlApplicationContext@1c247ad]: org.springframework.beans.factory.support.DefaultListableBeanFactory@f264c6
              [java] 26-May-2012 00:57:46 org.springframework.core.io.support.PropertiesLoaderSupport loadProperties
              [java] INFO: Loading properties file from class path resource [tmp_project.properties]
              [java] 26-May-2012 00:57:46 org.springframework.beans.factory.support.DefaultListableBeanFactory preInstantiateSingletons
              [java] INFO: Pre-instantiating singletons in org.springframework.beans.factory.support.DefaultListableBeanFactory@f264c6: defining beans [propertyConfigurer,InternalPartnerSupplier,IExternalPartnerSupplierService,InternalPartnerSupplierEJB,IExternalPartnerSupplierServiceEJB,IInternalCompositeSupplierService,FailingInternalPartnerSupplierMissingEPS,FailingInternalPartnerSupplierMissingQwr,WriteQuoteRequest,FailingMockProvider,loggerBean,headerHelperBean]; root of factory hierarchy
              [java] Creating new instance of class writequoterequest.partnersuppliercomposite.weblogicfusionorderdemo.file.adapter.pcbpel.com.oracle.xmlns.mock.Write_pptMock
              [java] Creating new instance of class writequoterequest.partnersuppliercomposite.weblogicfusionorderdemo.file.adapter.pcbpel.com.oracle.xmlns.mock.Write_pptMock
              [java] Creating new instance of class writequoterequest.partnersuppliercomposite.weblogicfusionorderdemo.file.adapter.pcbpel.com.oracle.xmlns.mock.Write_pptMock
              [java] Local Supplier: com.otn.sample.fod.soa.internalsupplier.InternalSupplierMediator@1a282af -> com.otn.sample.fod.soa.externalps.test.MockExternalPartnerSupplierTest@31d908
              [java] Got write request for quote ..
              [java] > Got correct price from local supplier mock
              [java] Remote supplier: com.otn.sample.fod.soa.internalsupplier.InternalSupplierMediator@1f5bf7c -> weblogic.sca.binding.ejb.service.Ejb3RemoteServiceHandler@1f645e4
              [java] Got write request for quote ..
              [java] -> someProduct qty: 1 price: 10.0
              [java] -> someProduct1 qty: 2 price: 20.0
              [java] > Got correct price from ejb based supplier
              [java] Got remote supplier: com.otn.sample.fod.soa.internalsupplier.InternalSupplierMediator@1f5bf7c -> weblogic.sca.binding.ejb.service.Ejb3RemoteServiceHandler@18c9b49
              [java] Cannot use item, is of type: java.lang.String, must be of type: com.otn.sample.fod.soa.externalps.OrderItem
              [java] > Got expected exception ..
              [java] Testing with empty EPS and empty QWriter
              [java] Got exception: ExternalPartnerSupplier not available, check spring context
              [java] 26-May-2012 00:57:48 com.otn.sample.fod.soa.internalsupplier.test.MockLoggerImpl log
              [java] WARNING: convertToInternalSupplierEx
              [java] com.otn.sample.fod.soa.internalsupplier.exception.InternalSupplierException: A generic exception occured in the mediator [Intentionally failing, negative testcase]
              [java] Please refer to the cause.
              [java]      at com.otn.sample.fod.soa.internalsupplier.InternalSupplierMediator.convertToInternalSupplierEx(InternalSupplierMediator.java:247)
              [java]      at com.otn.sample.fod.soa.internalsupplier.InternalSupplierMediator.getPriceForOrderItemList(InternalSupplierMediator.java:119)
              [java]      at com.otn.sample.fod.soa.TestSpringComponents.testFailingISE(TestSpringComponents.java:208)
              [java]      at com.otn.sample.fod.soa.TestSpringComponents.<init>(TestSpringComponents.java:70)
              [java]      at com.otn.sample.fod.soa.TestSpringComponents.main(TestSpringComponents.java:266)
              [java]      at sun.reflect.NativeMethodAccessorImpl.invoke0(Native Method)
              [java]      at sun.reflect.NativeMethodAccessorImpl.invoke(NativeMethodAccessorImpl.java:39)
              [java]      at sun.reflect.DelegatingMethodAccessorImpl.invoke(DelegatingMethodAccessorImpl.java:25)
              [java]      at java.lang.reflect.Method.invoke(Method.java:597)
              [java]      at org.apache.tools.ant.taskdefs.ExecuteJava.run(ExecuteJava.java:217)
              [java]      at org.apache.tools.ant.taskdefs.ExecuteJava.execute(ExecuteJava.java:152)
              [java]      at org.apache.tools.ant.taskdefs.Java.run(Java.java:764)
              [java]      at org.apache.tools.ant.taskdefs.Java.executeJava(Java.java:218)
              [java]      at org.apache.tools.ant.taskdefs.Java.executeJava(Java.java:132)
              [java]      at org.apache.tools.ant.taskdefs.Java.execute(Java.java:105)
              [java]      at org.apache.tools.ant.UnknownElement.execute(UnknownElement.java:288)
              [java]      at sun.reflect.GeneratedMethodAccessor1.invoke(Unknown Source)
              [java]      at sun.reflect.DelegatingMethodAccessorImpl.invoke(DelegatingMethodAccessorImpl.java:25)
              [java]      at java.lang.reflect.Method.invoke(Method.java:597)
              [java]      at org.apache.tools.ant.dispatch.DispatchUtils.execute(DispatchUtils.java:106)
              [java]      at org.apache.tools.ant.Task.perform(Task.java:348)
              [java]      at org.apache.tools.ant.Target.execute(Target.java:357)
              [java]      at org.apache.tools.ant.Target.performTasks(Target.java:385)
              [java]      at org.apache.tools.ant.Project.executeSortedTargets(Project.java:1337)
              [java]      at org.apache.tools.ant.helper.SingleCheckExecutor.executeTargets(SingleCheckExecutor.java:38)
              [java]      at org.apache.tools.ant.Project.executeTargets(Project.java:1189)
              [java]      at org.apache.tools.ant.taskdefs.Ant.execute(Ant.java:416)
              [java]      at org.apache.tools.ant.UnknownElement.execute(UnknownElement.java:288)
              [java]      at sun.reflect.GeneratedMethodAccessor1.invoke(Unknown Source)
              [java]      at sun.reflect.DelegatingMethodAccessorImpl.invoke(DelegatingMethodAccessorImpl.java:25)
              [java]      at java.lang.reflect.Method.invoke(Method.java:597)
              [java]      at org.apache.tools.ant.dispatch.DispatchUtils.execute(DispatchUtils.java:106)
              [java]      at org.apache.tools.ant.Task.perform(Task.java:348)
              [java]      at org.apache.tools.ant.Target.execute(Target.java:357)
              [java]      at org.apache.tools.ant.Target.performTasks(Target.java:385)
              [java]      at org.apache.tools.ant.Project.executeSortedTargets(Project.java:1337)
              [java]      at org.apache.tools.ant.helper.SingleCheckExecutor.executeTargets(SingleCheckExecutor.java:38)
              [java]      at org.apache.tools.ant.Project.executeTargets(Project.java:1189)
              [java]      at org.apache.tools.ant.taskdefs.Ant.execute(Ant.java:416)
              [java]      at org.apache.tools.ant.taskdefs.CallTarget.execute(CallTarget.java:105)
              [java]      at org.apache.tools.ant.UnknownElement.execute(UnknownElement.java:288)
              [java]      at sun.reflect.GeneratedMethodAccessor1.invoke(Unknown Source)
              [java]      at sun.reflect.DelegatingMethodAccessorImpl.invoke(DelegatingMethodAccessorImpl.java:25)
              [java]      at java.lang.reflect.Method.invoke(Method.java:597)
              [java]      at org.apache.tools.ant.dispatch.DispatchUtils.execute(DispatchUtils.java:106)
              [java]      at org.apache.tools.ant.Task.perform(Task.java:348)
              [java]      at org.apache.tools.ant.Target.execute(Target.java:357)
              [java]      at org.apache.tools.ant.Target.performTasks(Target.java:385)
              [java]      at org.apache.tools.ant.Project.executeSortedTargets(Project.java:1337)
              [java]      at org.apache.tools.ant.Project.executeTarget(Project.java:1306)
              [java]      at org.apache.tools.ant.helper.DefaultExecutor.executeTargets(DefaultExecutor.java:41)
              [java]      at org.apache.tools.ant.Project.executeTargets(Project.java:1189)
              [java]      at org.apache.tools.ant.Main.runBuild(Main.java:758)
              [java]      at org.apache.tools.ant.Main.startAnt(Main.java:217)
              [java]      at org.apache.tools.ant.Main.start(Main.java:179)
              [java]      at org.apache.tools.ant.Main.main(Main.java:268)
              [java] Caused by: java.lang.RuntimeException: Intentionally failing, negative testcase
              [java]      at writequoterequest.partnersuppliercomposite.weblogicfusionorderdemo.file.adapter.pcbpel.com.oracle.xmlns.mock.Write_pptFailingMock.write(Write_pptFailingMock.java:13)
              [java]      at com.otn.sample.fod.soa.internalsupplier.InternalSupplierMediator.getPriceForOrderItemList(InternalSupplierMediator.java:104)
              [java]      ... 54 more
              [java] Got composite service exposed as ejb: oracle.integration.platform.blocks.ejb.InvocationHandlerWrapper@6a1ed1
              [java] > Got correct price from ejb based supplier
              [java] 26-May-2012 00:57:48 org.springframework.context.support.AbstractApplicationContext doClose
              [java] INFO: Closing org.springframework.context.support.ClassPathXmlApplicationContext@1c247ad: display name [org.springframework.context.support.ClassPathXmlApplicationContext@1c247ad]; startup date [Sat May 26 00:57:45 BST 2012]; root of context hierarchy
              [java] 26-May-2012 00:57:48 org.springframework.beans.factory.support.DefaultSingletonBeanRegistry destroySingletons
              [java] INFO: Destroying singletons in org.springframework.beans.factory.support.DefaultListableBeanFactory@f264c6: defining beans [propertyConfigurer,InternalPartnerSupplier,IExternalPartnerSupplierService,InternalPartnerSupplierEJB,IExternalPartnerSupplierServiceEJB,IInternalCompositeSupplierService,FailingInternalPartnerSupplierMissingEPS,FailingInternalPartnerSupplierMissingQwr,WriteQuoteRequest,FailingMockProvider,loggerBean,headerHelperBean]; root of factory hierarchy
              [java] Spring based tests completed successfully ..
              [delete] Deleting: F:\stageFMW\DEMO_DOWNLOAD_HOME\11.1.1.6\CompositeServices\PartnerSupplierComposite\SCA-INF\classes\tmp_project.properties
              • 4. Re: Fusion Order Demo errors  server-setup-seed-deploy-test
                939861
                continued..........


                test-composite:
                [echo] Running sca-testing for PartnerSupplierComposite against t3://localhost:7001
                [echo] Found 1 test(s) in F:\stageFMW\DEMO_DOWNLOAD_HOME\11.1.1.6\CompositeServices\PartnerSupplierComposite\bin/../testsuites/SupplierTestSuite/tests
                [echo] Running scatest using oracle.home = F:\Oracle\Middleware\Jdeveloper\jdeveloper\

                test:
                [echo] Classpth = F:\Oracle\Middleware\Jdeveloper\jdeveloper\soa\modules\oracle.soa.fabric_11.1.1\fabric-ext.jar;F:\Oracle\Middleware\Jdeveloper\jdeveloper\soa\modules\oracle.soa.fabric_11.1.1\fabric-runtime.jar;F:\Oracle\Middleware\Jdeveloper\jdeveloper\soa\modules\oracle.soa.fabric_11.1.1\oracle-soa-client-api.jar;F:\Oracle\Middleware\Jdeveloper\jdeveloper\soa\modules\oracle.soa.mgmt_11.1.1\soa-infra-mgmt.jar;F:\Oracle\Middleware\Jdeveloper\jdeveloper\soa\modules\oracle.soa.bpel_11.1.1\orabpel-common.jar;F:\Oracle\Middleware\Jdeveloper\jdeveloper\soa\modules\oracle.soa.bpel_11.1.1\orabpel.jar;F:\Oracle\Middleware\Jdeveloper\wlserver_10.3\server\lib\weblogic.jar;F:\Oracle\Middleware\Jdeveloper\oracle_common\modules\oracle.jps_11.1.1\jps-api.jar;F:\Oracle\Middleware\Jdeveloper\oracle_common\modules\oracle.jps_11.1.1\jps-common.jar;F:\Oracle\Middleware\Jdeveloper\oracle_common\modules\oracle.jps_11.1.1\jps-internal.jar;F:\Oracle\Middleware\Jdeveloper\oracle_common\modules\oracle.jrf_11.1.1\jrf-api.jar;F:\Oracle\Middleware\Jdeveloper\jdeveloper\soa\modules\oracle.soa.mgmt_11.1.1\soa-client-stubs-was.jar;F:\Oracle\Middleware\Jdeveloper\jdeveloper\bin\${was.home}\runtimes\com.ibm.ws.ejb.thinclient_7.0.0.jar;F:\Oracle\Middleware\Jdeveloper\jdeveloper\bin\${was.home}\runtimes\com.ibm.ws.orb_7.0.0.jar;F:\Oracle\Middleware\Jdeveloper\jdeveloper\bin\${was.home}\plugins\com.ibm.ws.runtime.jar;F:\Oracle\Middleware\Jdeveloper\jdeveloper\bin\${was.home}\runtimes\com.ibm.ws.admin.client_7.0.0.jar
                [echo] Running scatest using oracle.home = F:\Oracle\Middleware\Jdeveloper\jdeveloper\ PartnerSupplierComposite
                [echo] Using context = build.properties
                [echo] Using path = F:\Oracle\Middleware\Jdeveloper\jdeveloper\soa\modules\oracle.soa.fabric_11.1.1\fabric-ext.jar;F:\Oracle\Middleware\Jdeveloper\jdeveloper\soa\modules\oracle.soa.fabric_11.1.1\fabric-runtime.jar;F:\Oracle\Middleware\Jdeveloper\jdeveloper\soa\modules\oracle.soa.fabric_11.1.1\oracle-soa-client-api.jar;F:\Oracle\Middleware\Jdeveloper\jdeveloper\soa\modules\oracle.soa.mgmt_11.1.1\soa-infra-mgmt.jar;F:\Oracle\Middleware\Jdeveloper\jdeveloper\soa\modules\oracle.soa.bpel_11.1.1\orabpel-common.jar;F:\Oracle\Middleware\Jdeveloper\jdeveloper\soa\modules\oracle.soa.bpel_11.1.1\orabpel.jar;F:\Oracle\Middleware\Jdeveloper\wlserver_10.3\server\lib\weblogic.jar;F:\Oracle\Middleware\Jdeveloper\oracle_common\modules\oracle.jps_11.1.1\jps-api.jar;F:\Oracle\Middleware\Jdeveloper\oracle_common\modules\oracle.jps_11.1.1\jps-common.jar;F:\Oracle\Middleware\Jdeveloper\oracle_common\modules\oracle.jps_11.1.1\jps-internal.jar;F:\Oracle\Middleware\Jdeveloper\oracle_common\modules\oracle.jrf_11.1.1\jrf-api.jar;F:\Oracle\Middleware\Jdeveloper\jdeveloper\soa\modules\oracle.soa.mgmt_11.1.1\soa-client-stubs-was.jar;F:\Oracle\Middleware\Jdeveloper\jdeveloper\bin\${was.home}\runtimes\com.ibm.ws.ejb.thinclient_7.0.0.jar;F:\Oracle\Middleware\Jdeveloper\jdeveloper\bin\${was.home}\runtimes\com.ibm.ws.orb_7.0.0.jar;F:\Oracle\Middleware\Jdeveloper\jdeveloper\bin\${was.home}\plugins\com.ibm.ws.runtime.jar;F:\Oracle\Middleware\Jdeveloper\jdeveloper\bin\${was.home}\runtimes\com.ibm.ws.admin.client_7.0.0.jar
                [input] skipping input as property scatest.input has already been set.
                [input] skipping input as property jndi.properties.input has already been set.
                [scatest] Running limited set of suites SupplierTestSuite
                [scatest] native formatting
                [scatest] native
                [scatest] [<test:testRunResults compositeDN="soaFusionOrderDemo/PartnerSupplierComposite" errorCount="0" failureCount="0" testCount="1" passCount="1" inProgressCount="0" runId="71fdc6e2051eaf7b:16ca5dc4:1377984d097:-7be5" runName="antRun-TestFwk" startDate="2012-05-26T00:57:49.250+01:00" endDate="2012-05-26T00:57:49.359+01:00" xmlns:test="http://xmlns.oracle.com/sca/2006/test"><test:testSuite suiteName="SupplierTestSuite"><test:testResult compositeId="40032" compositeDN="soaFusionOrderDemo/PartnerSupplierComposite!1.0*soa_477ab66f-e6e9-4b1d-8738-2df33426dc72" endDate="2012-05-26T00:57:49.359+01:00" startDate="2012-05-26T00:57:49.281+01:00" suiteName="SupplierTestSuite" testName="SupplierBPELTest.xml" testRunName="antRun-TestFwk" testRunId="71fdc6e2051eaf7b:16ca5dc4:1377984d097:-7be5" outcome="passed" callHandlerClassName=""><test:wireActionResults wireSource="PartnerSupplierMediator/ExternalPartnerSupplier.externalpartnersupplier_client"><test:assertionOutcome outcome="passed"><test:assertion comparisonMethod="string">
                <test:description>route to bpel</test:description>
                <test:expected>
                <test:location key="input" partName="payload" xpath="/client:WarehouseProcessRequest/client:orderTotal" xmlns:client="http://www.partnersupplier.example.com/ns/warehouse"/>
                <test:simple>1001</test:simple>
                </test:expected>
                </test:assertion><test:actual><test:simple>1001</test:simple></test:actual></test:assertionOutcome></test:wireActionResults></test:testResult></test:testSuite><test:property propertyName="db.type" propertyValue="oracle"/><test:property propertyName="bpel.host.name" propertyValue="bizon"/><test:property propertyName="soa.oracle.home" propertyValue="F:\Oracle\Middleware\Oracle_SOA1"/></test:testRunResults>]
                [scatest] F:\stageFMW\DEMO_DOWNLOAD_HOME\11.1.1.6\CompositeServices\PartnerSupplierComposite\bin\..\testsuites\results\antRun-TestFwk.xml
                [echo] Results written to: F:\stageFMW\DEMO_DOWNLOAD_HOME\11.1.1.6\CompositeServices\PartnerSupplierComposite\bin/../testsuites/results
                [delete] Deleting: F:\stageFMW\DEMO_DOWNLOAD_HOME\11.1.1.6\CompositeServices\PartnerSupplierComposite\bin\tmp-jndi.properties

                test-composite:
                [echo] Running sca-testing for OrderBookingComposite against t3://localhost:7001
                [echo] Found 1 test(s) in F:\stageFMW\DEMO_DOWNLOAD_HOME\11.1.1.6\CompositeServices\OrderBookingComposite\bin/../testsuites/OrderBookingMainTestsuite/tests
                [echo] Running scatest using oracle.home = F:\Oracle\Middleware\Jdeveloper\jdeveloper\

                test:
                [echo] Classpth = F:\Oracle\Middleware\Jdeveloper\jdeveloper\soa\modules\oracle.soa.fabric_11.1.1\fabric-ext.jar;F:\Oracle\Middleware\Jdeveloper\jdeveloper\soa\modules\oracle.soa.fabric_11.1.1\fabric-runtime.jar;F:\Oracle\Middleware\Jdeveloper\jdeveloper\soa\modules\oracle.soa.fabric_11.1.1\oracle-soa-client-api.jar;F:\Oracle\Middleware\Jdeveloper\jdeveloper\soa\modules\oracle.soa.mgmt_11.1.1\soa-infra-mgmt.jar;F:\Oracle\Middleware\Jdeveloper\jdeveloper\soa\modules\oracle.soa.bpel_11.1.1\orabpel-common.jar;F:\Oracle\Middleware\Jdeveloper\jdeveloper\soa\modules\oracle.soa.bpel_11.1.1\orabpel.jar;F:\Oracle\Middleware\Jdeveloper\wlserver_10.3\server\lib\weblogic.jar;F:\Oracle\Middleware\Jdeveloper\oracle_common\modules\oracle.jps_11.1.1\jps-api.jar;F:\Oracle\Middleware\Jdeveloper\oracle_common\modules\oracle.jps_11.1.1\jps-common.jar;F:\Oracle\Middleware\Jdeveloper\oracle_common\modules\oracle.jps_11.1.1\jps-internal.jar;F:\Oracle\Middleware\Jdeveloper\oracle_common\modules\oracle.jrf_11.1.1\jrf-api.jar;F:\Oracle\Middleware\Jdeveloper\jdeveloper\soa\modules\oracle.soa.mgmt_11.1.1\soa-client-stubs-was.jar;F:\Oracle\Middleware\Jdeveloper\jdeveloper\bin\${was.home}\runtimes\com.ibm.ws.ejb.thinclient_7.0.0.jar;F:\Oracle\Middleware\Jdeveloper\jdeveloper\bin\${was.home}\runtimes\com.ibm.ws.orb_7.0.0.jar;F:\Oracle\Middleware\Jdeveloper\jdeveloper\bin\${was.home}\plugins\com.ibm.ws.runtime.jar;F:\Oracle\Middleware\Jdeveloper\jdeveloper\bin\${was.home}\runtimes\com.ibm.ws.admin.client_7.0.0.jar
                [echo] Running scatest using oracle.home = F:\Oracle\Middleware\Jdeveloper\jdeveloper\ OrderBookingComposite
                [echo] Using context = build.properties
                [echo] Using path = F:\Oracle\Middleware\Jdeveloper\jdeveloper\soa\modules\oracle.soa.fabric_11.1.1\fabric-ext.jar;F:\Oracle\Middleware\Jdeveloper\jdeveloper\soa\modules\oracle.soa.fabric_11.1.1\fabric-runtime.jar;F:\Oracle\Middleware\Jdeveloper\jdeveloper\soa\modules\oracle.soa.fabric_11.1.1\oracle-soa-client-api.jar;F:\Oracle\Middleware\Jdeveloper\jdeveloper\soa\modules\oracle.soa.mgmt_11.1.1\soa-infra-mgmt.jar;F:\Oracle\Middleware\Jdeveloper\jdeveloper\soa\modules\oracle.soa.bpel_11.1.1\orabpel-common.jar;F:\Oracle\Middleware\Jdeveloper\jdeveloper\soa\modules\oracle.soa.bpel_11.1.1\orabpel.jar;F:\Oracle\Middleware\Jdeveloper\wlserver_10.3\server\lib\weblogic.jar;F:\Oracle\Middleware\Jdeveloper\oracle_common\modules\oracle.jps_11.1.1\jps-api.jar;F:\Oracle\Middleware\Jdeveloper\oracle_common\modules\oracle.jps_11.1.1\jps-common.jar;F:\Oracle\Middleware\Jdeveloper\oracle_common\modules\oracle.jps_11.1.1\jps-internal.jar;F:\Oracle\Middleware\Jdeveloper\oracle_common\modules\oracle.jrf_11.1.1\jrf-api.jar;F:\Oracle\Middleware\Jdeveloper\jdeveloper\soa\modules\oracle.soa.mgmt_11.1.1\soa-client-stubs-was.jar;F:\Oracle\Middleware\Jdeveloper\jdeveloper\bin\${was.home}\runtimes\com.ibm.ws.ejb.thinclient_7.0.0.jar;F:\Oracle\Middleware\Jdeveloper\jdeveloper\bin\${was.home}\runtimes\com.ibm.ws.orb_7.0.0.jar;F:\Oracle\Middleware\Jdeveloper\jdeveloper\bin\${was.home}\plugins\com.ibm.ws.runtime.jar;F:\Oracle\Middleware\Jdeveloper\jdeveloper\bin\${was.home}\runtimes\com.ibm.ws.admin.client_7.0.0.jar
                [input] skipping input as property scatest.input has already been set.
                [input] skipping input as property jndi.properties.input has already been set.
                [scatest] Running limited set of suites OrderBookingMainTestsuite
                [scatest] java.lang.RuntimeException: The test run has timed out. Some tests did not complete in the allocated time.
                     at oracle.soa.management.internal.ejb.impl.SOATestBeanImpl.executeTestCases(SOATestBeanImpl.java:136)
                     at sun.reflect.GeneratedMethodAccessor10936.invoke(Unknown Source)
                     at sun.reflect.DelegatingMethodAccessorImpl.invoke(DelegatingMethodAccessorImpl.java:25)
                     at java.lang.reflect.Method.invoke(Method.java:597)
                     at com.bea.core.repackaged.springframework.aop.support.AopUtils.invokeJoinpointUsingReflection(AopUtils.java:310)
                     at com.bea.core.repackaged.springframework.aop.framework.ReflectiveMethodInvocation.invokeJoinpoint(ReflectiveMethodInvocation.java:182)
                     at com.bea.core.repackaged.springframework.aop.framework.ReflectiveMethodInvocation.proceed(ReflectiveMethodInvocation.java:149)
                     at com.oracle.pitchfork.intercept.MethodInvocationInvocationContext.proceed(MethodInvocationInvocationContext.java:103)
                     at oracle.security.jps.ee.ejb.JpsAbsInterceptor$1.run(JpsAbsInterceptor.java:113)
                     at java.security.AccessController.doPrivileged(Native Method)
                     at oracle.security.jps.util.JpsSubject.doAsPrivileged(JpsSubject.java:315)
                     at oracle.security.jps.ee.util.JpsPlatformUtil.runJaasMode(JpsPlatformUtil.java:442)
                     at oracle.security.jps.ee.ejb.JpsAbsInterceptor.runJaasMode(JpsAbsInterceptor.java:100)
                     at oracle.security.jps.ee.ejb.JpsAbsInterceptor.intercept(JpsAbsInterceptor.java:154)
                     at oracle.security.jps.ee.ejb.JpsInterceptor.intercept(JpsInterceptor.java:113)
                     at sun.reflect.GeneratedMethodAccessor2341.invoke(Unknown Source)
                     at sun.reflect.DelegatingMethodAccessorImpl.invoke(DelegatingMethodAccessorImpl.java:25)
                     at java.lang.reflect.Method.invoke(Method.java:597)
                     at com.bea.core.repackaged.springframework.aop.support.AopUtils.invokeJoinpointUsingReflection(AopUtils.java:310)
                     at com.oracle.pitchfork.intercept.JeeInterceptorInterceptor.invoke(JeeInterceptorInterceptor.java:68)
                     at com.bea.core.repackaged.springframework.aop.framework.ReflectiveMethodInvocation.proceed(ReflectiveMethodInvocation.java:171)
                     at com.bea.core.repackaged.springframework.aop.support.DelegatingIntroductionInterceptor.doProceed(DelegatingIntroductionInterceptor.java:131)
                     at com.bea.core.repackaged.springframework.aop.support.DelegatingIntroductionInterceptor.invoke(DelegatingIntroductionInterceptor.java:119)
                     at com.bea.core.repackaged.springframework.aop.framework.ReflectiveMethodInvocation.proceed(ReflectiveMethodInvocation.java:171)
                     at com.oracle.pitchfork.spi.MethodInvocationVisitorImpl.visit(MethodInvocationVisitorImpl.java:34)
                     at weblogic.ejb.container.injection.EnvironmentInterceptorCallbackImpl.callback(EnvironmentInterceptorCallbackImpl.java:54)
                     at com.oracle.pitchfork.spi.EnvironmentInterceptor.invoke(EnvironmentInterceptor.java:42)
                     at com.bea.core.repackaged.springframework.aop.framework.ReflectiveMethodInvocation.proceed(ReflectiveMethodInvocation.java:171)
                     at com.bea.core.repackaged.springframework.aop.interceptor.ExposeInvocationInterceptor.invoke(ExposeInvocationInterceptor.java:89)
                     at com.bea.core.repackaged.springframework.aop.framework.ReflectiveMethodInvocation.proceed(ReflectiveMethodInvocation.java:171)
                     at com.bea.core.repackaged.springframework.aop.support.DelegatingIntroductionInterceptor.doProceed(DelegatingIntroductionInterceptor.java:131)
                     at com.bea.core.repackaged.springframework.aop.support.DelegatingIntroductionInterceptor.invoke(DelegatingIntroductionInterceptor.java:119)
                     at com.bea.core.repackaged.springframework.aop.framework.ReflectiveMethodInvocation.proceed(ReflectiveMethodInvocation.java:171)
                     at com.bea.core.repackaged.springframework.aop.framework.JdkDynamicAopProxy.invoke(JdkDynamicAopProxy.java:204)
                     at $Proxy391.executeTestCases(Unknown Source)
                     at oracle.soa.management.internal.ejb.impl.SOATestBean_ra84ps_SOATestBeanImpl.__WL_invoke(Unknown Source)
                     at weblogic.ejb.container.internal.SessionRemoteMethodInvoker.invoke(SessionRemoteMethodInvoker.java:40)
                     at oracle.soa.management.internal.ejb.impl.SOATestBean_ra84ps_SOATestBeanImpl.executeTestCases(Unknown Source)
                     at oracle.soa.management.internal.ejb.impl.SOATestBean_ra84ps_SOATestBeanImpl_WLSkel.invoke(Unknown Source)
                     at weblogic.rmi.internal.BasicServerRef.invoke(BasicServerRef.java:667)
                     at weblogic.rmi.internal.BasicServerRef$1.run(BasicServerRef.java:522)
                     at weblogic.security.acl.internal.AuthenticatedSubject.doAs(AuthenticatedSubject.java:363)
                     at weblogic.security.service.SecurityManager.runAs(SecurityManager.java:146)
                     at weblogic.rmi.internal.BasicServerRef.handleRequest(BasicServerRef.java:518)
                     at weblogic.rmi.internal.wls.WLSExecuteRequest.run(WLSExecuteRequest.java:118)
                     at weblogic.work.ExecuteThread.execute(ExecuteThread.java:256)
                     at weblogic.work.ExecuteThread.run(ExecuteThread.java:221)
                [scatest]
                [scatest] build exception caught

                BUILD FAILED
                F:\stageFMW\DEMO_DOWNLOAD_HOME\11.1.1.6\CompositeServices\bin\build.xml:321: The following error occurred while executing this line:
                F:\stageFMW\DEMO_DOWNLOAD_HOME\11.1.1.6\CompositeServices\bin\build.xml:443: The following error occurred while executing this line:
                F:\stageFMW\DEMO_DOWNLOAD_HOME\11.1.1.6\CompositeServices\OrderBookingComposite\bin\build_sca_composite.xml:242: The following error occurred while executing this line:
                F:\Oracle\Middleware\Jdeveloper\jdeveloper\bin\ant-sca-test.xml:111: The test run has timed out. Some tests did not complete in the allocated time.

                Total time: 9 minutes 50 seconds
                • 5. Re: Fusion Order Demo errors  server-setup-seed-deploy-test
                  Antony Reynolds-Oracle
                  I encountered a number of problems deploying FOD onto 11.1.1.6. I documented how I got it working [Deploying Fusion Order Demo on 11.1.1.6|https://blogs.oracle.com/reynolds/entry/deploying_fusion_order_demo_on] .

                  Antony
                  • 6. Re: Fusion Order Demo errors  server-setup-seed-deploy-test
                    Vamseeg-Oracle
                    From logs, I see that FOD got deployed fine, API tests did run fine. Only issue seen is test suites of OrderBookingComposite did time out.

                    scatest] Running limited set of suites OrderBookingMainTestsuite
                    [scatest] java.lang.RuntimeException: The test run has timed out. Some tests did not complete in the allocated time.

                    You can manually test this:
                    Login to EM console and naviate to OrderProcessing Composite.
                    TestCase1) Input value < 1000 (this will go in auto approval).
                    TestCase2) > 1000. Login to worklist app with jstein and approve the task. This will complete the order
                    Goto EM and see if instances are in completed state for above testcases.
                    TestCase3) OrderBookingcomposite with UpdateOrder endpoint:
                    Input Value=2000 and Completed.
                    This will do update orders.
                    TestCase4) To test B2B:
                    Copy \CompositeServices\B2BX12OrderGateway\config\MarketInc_850_1.x12 file to \tmp\orclsrvs_in
                    This will create instance in B2BOrdeBookingcomposite and then invoke OrderBookingcomposite. Follow same steps as (b) for approval.