0 Replies Latest reply: Sep 15, 2012 10:07 AM by 961355 RSS

    AIA Demo Application failed during Installation.

    961355
      Hi ,

      I am getting this error while Installing and Deploying AIA Demo Application(deployment script ant –f deployDemo.xml in command window).Please find the error message displayed on the command window.

      D:\Devrep\Oracle\AIAHome\samples\AIADemo\config>ant -f deployDemo.xml
      Buildfile: deployDemo.xml

      InstallDemo:
      [echo]
      [echo] /------------------------------------------------------------\
      [echo] ! !
      [echo] ! Setting the environment to install !
      [echo] ! AIA Demo !

      [echo] ! !
      [echo] ! Verify D:\Devrep\Oracle\AIAHome\aia_instances\AIA/logs/AIAdemoI
      nstall.log !
      [echo] \------------------------------------------------------------/
      [echo]
      [echo] /----------------------------------------------------------\
      [echo] ! !
      [echo] ! Installing AIA Demo !

      [echo] ! !
      [echo] \----------------------------------------------------------/

      AID:

      BUILD FAILED
      D:\Devrep\Oracle\AIAHome\samples\AIADemo\config\deployDemo.xml:91: The following
      error occurred while executing this line:
      D:\Devrep\Oracle\AIAHome\samples\AIADemo\config\deployDemo.xml:123: The followin
      g error occurred while executing this line:
      D:\Devrep\Oracle\AIAHome\Infrastructure\Install\AID\AIAInstallDriver.xml:35: web
      logic.security.internal.encryption.EncryptionServiceException: weblogic.security
      .internal.encryption.EncryptionServiceException: weblogic.security.internal.encr
      yption.EncryptionServiceException: [Security:090219]Error decrypting Secret Key
      java.lang.SecurityException: The provider self-integrity check failed.

      Please help me out how to resolve this issue.I had post this thread also last time but unfortunately I didn't got any response so far

      Thanks
      Biswanath