1 7 8 9 10 11 12 Previous Next 173 Replies Latest reply: May 30, 2013 12:07 PM by Hussein Sawwan-Oracle Go to original post Branched to a new discussion. RSS
      • 120. Re: Upgrading  ebs 11i to r12 12.1.1 on Suse
        EBSDBA
        Hi,

        Please see

        AccessControlException Error Is Displayed In Java Console When Launching Forms [ID 1234857.1]
        FRM-92050: Failed To Connect - Java.security.AccesControlException: Access Denied [ID 1538977.1]

        Thanks
        • 121. Re: Upgrading  ebs 11i to r12 12.1.1 on Suse
          Hussein Sawwan-Oracle
          Generate all JAR files via adadmin (with FORCE option) and check then.

          Thanks,
          Hussein
          • 122. Re: Upgrading  ebs 11i to r12 12.1.1 on Suse
            user10994730
            Thanks Hussein and EBSDBA.

            The issue is I have 64 bit java under my IAS_ORACLE_HOME.
            oracle@hmf-hrm-001:/data/rel12/apps/tech_st/10.1.3/appsutil>
            I have uninstalled 64 bit and installed 32 and I was able to open forms using Firfox and IE8.


            Thanks.
            • 123. Re: Upgrading  ebs 11i to r12 12.1.1 on Suse
              Hussein Sawwan-Oracle
              user10994730 wrote:
              Thanks Hussein and EBSDBA.

              The issue is I have 64 bit java under my IAS_ORACLE_HOME.
              oracle@hmf-hrm-001:/data/rel12/apps/tech_st/10.1.3/appsutil>
              I have uninstalled 64 bit and installed 32 and I was able to open forms using Firfox and IE8.


              Thanks.
              Thanks for the update.

              The 64-bit version is not supported as mentioned in (Using Latest Java 6.0 Update With Oracle E-Business Suite Release 12 [ID 455492.1]).

              Thanks,
              Hussein
              • 124. Re: Upgrading  ebs 11i to r12 12.1.1 on Suse
                user10994730
                I am getting following error while trying to click on selfservice employee/create timecard.

                oracle.apps.fnd.framework.OAException: java.sql.SQLException: ORA-20001: SQL_PLSQL_ERROR: N, ROUTINE, MO_GLOBAL.INIT, N, ERRNO, -20001, N, REASON, ORA-20001: APP-FND-02901: You do not have access privilege to any operating unit. Please check if your profile option MO: Security Profile includes any operating unit or the profile option MO: Operating Unit is set.
                ORA-06512: at "APPS.FND_MESSAGE", line 509
                ORA-06512: at "APPS.MO_GLOBAL", line 36
                ORA-06512: at "APPS.MO_GLOBAL", line 757
                ORA-06512: at "APPS.MO_GLOBAL", line 700
                ORA-06512: at "APPS.HXC_TIMECARD_PROPERTIES", line 633
                ORA-06512: at "APPS.HXC_TIMECARD_PROPERTIES", line 653
                ORA-06512: at "APPS.HXC_TIMECARD_PROPERTIES", line 1157
                ORA-06512: at "APPS.HXC_TIMECARD_PROPERTIES", line 958
                ORA-06512: at "APPS.HXC_TIMECARD_PROPERTIES", line 935
                ORA-06512: at line 3


                And also under profile//system/MO:operating unit shows "Non usable Operating unit for Multi Org Conversion" LOV does not work.
                When click to under site for MO:operating unit LOV nothing happens.

                Thanks.
                • 125. Re: Upgrading  ebs 11i to r12 12.1.1 on Suse
                  Hussein Sawwan-Oracle
                  Please see (APP-HXT-39167 You do not have access privilege to any operating unit error on Timekeeper (HXTTIM00) Form [ID 579221.1]).

                  Thanks,
                  Hussein
                  • 126. Re: Upgrading  ebs 11i to r12 12.1.1 on Suse
                    user10994730
                    Thanks Hussein,

                    In was able to resolve with following.

                    SQL> SELECT org_information_id||'|'||
                    org_information_context||'|'||
                    organization_id||'|'||
                    org_information6||'|'
                    FROM HR_ORGANIZATION_INFORMATION
                    WHERE ORG_INFORMATION_ID IN
                    (SELECT O3.org_information_id
                    FROM HR_ALL_ORGANIZATION_UNITS O,
                    HR_ALL_ORGANIZATION_UNITS_TL OTL,
                    HR_ORGANIZATION_INFORMATION O2,
                    HR_ORGANIZATION_INFORMATION O3
                    WHERE O.ORGANIZATION_ID = O2.ORGANIZATION_ID
                    AND O.ORGANIZATION_ID = O3.ORGANIZATION_ID
                    AND O2.ORG_INFORMATION_CONTEXT
                    ||'' = 'CLASS'
                    AND O3.ORG_INFORMATION_CONTEXT = 'Operating Unit Information'
                    AND O2.ORG_INFORMATION1 = 'OPERATING_UNIT'
                    AND O2.ORG_INFORMATION2 = 'Y'
                    AND O.ORGANIZATION_ID = OTL.ORGANIZATION_ID
                    AND OTL.LANGUAGE = 'US'
                    )
                    AND org_information6 IS NOT NULL;

                    ORG_INFORMATION_ID||'|'||ORG_INFORMATION_CONTEXT||'|'||ORGANIZATION_ID||'|'||ORG
                    --------------------------------------------------------------------------------
                    402|Operating Unit Information|281|N|


                    SQL> update HR_ORGANIZATION_INFORMATION
                    2 set ORG_INFORMATION6 = NULL
                    3 where ORG_INFORMATION_ID=402 and ORG_INFORMATION6 is not NULL;

                    1 row updated.

                    SQL> commit;
                    • 127. Re: Upgrading  ebs 11i to r12 12.1.1 on Suse
                      Hussein Sawwan-Oracle
                      Thanks for the update and for sharing the solution.

                      I see the same solution mentioned in (ORA-20001 - SSWA View Requests form errors "You do not have access privilege to any operating unit." [ID 1292645.1]) so posting the Doc ID in case someone else needs this reference.

                      Thanks,
                      Hussein
                      • 128. Re: Upgrading  ebs 11i to r12 12.1.1 on Suse
                        user10994730
                        Thanks Hussein,

                        Edited by: user10994730 on Apr 3, 2013 11:31 AM
                        • 129. Re: Upgrading  ebs 11i to r12 12.1.1 on Suse
                          user10994730
                          I was appling additinal patch 8557019 as per(Upgrading OracleAS 10g Forms and Reports in Oracle E-Business Suite Release 12 [ID 437878.1]) and In got the following error.

                          I forgot to set this as per readme DE_ALL_OBJECTS_HINT=YES at unix prompt.

                          Do you think this could be the reason.

                          OPatch encounters the following issues during Make:
                          There were problems running make commands. The errors encounted were:
                          Error for command: cd /data/rel12/apps/tech_st/10.1.2//procbuilder/lib
                          /usr/bin/make -f ins_procbuilder.mk install ORACLE_HOME="/data/rel12/apps/tech_
                          st/10.1.2" 2>/data/rel12/apps/tech_st/10.1.2/.patch_storage/8557019/make_local.
                          stderr

                          Replying 'Y' will terminate the patch installation immediately.It WILL NOT resto
                          re any updates that have been performed to this point. It WILL NOT update the in
                          ventory.
                          Replying 'N' will continue with updating the inventory showing the patch has bee
                          n applied.
                          NOTE: After replying either 'Y' or 'N' it is critical to review:
                          Metalink Note 312767.1 How to rollback a failed Interim patch installation
                          .
                          Do you want to STOP?
                          Please respond Y|N >
                          Y

                          Help is appreciated.
                          • 130. Re: Upgrading  ebs 11i to r12 12.1.1 on Suse
                            Hussein Sawwan-Oracle
                            Can you find any errors in /data/rel12/apps/tech_st/10.1.2/.patch_storage/8557019/make_local.stderr file?

                            Thanks,
                            Hussein
                            • 131. Re: Upgrading  ebs 11i to r12 12.1.1 on Suse
                              user10994730
                              /usr/lib64/gcc/x86_64-suse-linux/4.3/../../../../x86_64-suse-linux/bin/ld: cannot find -lnls10
                              /usr/lib64/gcc/x86_64-suse-linux/4.3/../../../../x86_64-suse-linux/bin/ld: skipping incompatible /data/rel12/apps/tech_st/10.1.2/lib//stubs/libdl.so when searching for -ldl
                              /usr/lib64/gcc/x86_64-suse-linux/4.3/../../../../x86_64-suse-linux/bin/ld: skipping incompatible /data/rel12/apps/tech_st/10.1.2/lib/stubs//libdl.so when searching for -ldl
                              /usr/lib64/gcc/x86_64-suse-linux/4.3/../../../../x86_64-suse-linux/bin/ld: skipping incompatible /data/rel12/apps/tech_st/10.1.2/lib//stubs/libm.so when searching for -lm
                              /usr/lib64/gcc/x86_64-suse-linux/4.3/../../../../x86_64-suse-linux/bin/ld: skipping incompatible /data/rel12/apps/tech_st/10.1.2/lib/stubs//libm.so when searching for -lm
                              /usr/lib64/gcc/x86_64-suse-linux/4.3/../../../../x86_64-suse-linux/bin/ld: skipping incompatible /data/rel12/apps/tech_st/10.1.2/lib//stubs/libpthread.so when searching for -lpthread
                              /usr/lib64/gcc/x86_64-suse-linux/4.3/../../../../x86_64-suse-linux/bin/ld: skipping incompatible /data/rel12/apps/tech_st/10.1.2/lib/stubs//libpthread.so when searching for -lpthread
                              collect2: ld returned 1 exit status
                              make: *** [dejvm] Error 1
                              oracle@hmf-hrm-001:/data/rel12/apps/tech_st/10.1.2/.patch_storage/8557019>
                              • 132. Re: Upgrading  ebs 11i to r12 12.1.1 on Suse
                                Hussein Sawwan-Oracle
                                Do you have the patches mentioned in the following docs applied?

                                Applying Patch 8557019 and encounter /usr/bin/ld: cannot find -ldeb error running make -f ins_procbuilder.mk install [ID 1266729.1]
                                Patch 8557019: make: Fatal error: Command failed for target `dejvm'0.1.2/lib32/WS6U1/crti.o: open failed: No such file or directory [ID 1291895.1]

                                Thanks,
                                Hussein
                                • 133. Re: Upgrading  ebs 11i to r12 12.1.1 on Suse
                                  user10994730
                                  I was looking at following note and I did miss following.
                                  Applying Patch 8557019 and encounter /usr/bin/ld: cannot find -ldeb error running make -f ins_procbuilder.mk install [ID 1266729.1]

                                  Patch Installation Instructions:
                                  # --------------------------------
                                  # Please Apply Mandatory Patch 8551790.
                                  • 134. Re: Upgrading  ebs 11i to r12 12.1.1 on Suse
                                    Hussein Sawwan-Oracle
                                    user10994730 wrote:
                                    I was looking at following note and I did miss following.
                                    Applying Patch 8557019 and encounter /usr/bin/ld: cannot find -ldeb error running make -f ins_procbuilder.mk install [ID 1266729.1]

                                    Patch Installation Instructions:
                                    # --------------------------------
                                    # Please Apply Mandatory Patch 8551790.
                                    Yes, please apply the patch and check then. Please also see the other doc referenced in my previous reply.

                                    Thanks,
                                    Hussein