1 Reply Latest reply: Apr 29, 2013 2:31 AM by 706850 RSS

    Oracle installation Error

    706850
      I am installing Oracle 11g on my RHEL6 VM,

      During installation at 68% I am getting error. This is my make.log file


      /usr/bin/make -f ins_rdbms.mk rat_on part_on dm_on olap_on sdo_on ORACLE_HOME=/u01/app/product/11.2.0/dbhome_1//usr/bin/ar d /u01/app/product/11.2.0/dbhome_1/rdbms/lib/libknlopt.a kecnr.o
      /usr/bin/ar cr /u01/app/product/11.2.0/dbhome_1/rdbms/lib/libknlopt.a /u01/app/product/11.2.0/dbhome_1/rdbms/lib/kecwr.o
      /usr/bin/ar d /u01/app/product/11.2.0/dbhome_1/rdbms/lib/libknlopt.a ksnkkpo.o
      /usr/bin/ar cr /u01/app/product/11.2.0/dbhome_1/rdbms/lib/libknlopt.a /u01/app/product/11.2.0/dbhome_1/rdbms/lib/kkpoban.o
      /usr/bin/ar d /u01/app/product/11.2.0/dbhome_1/rdbms/lib/libknlopt.a dmndm.o
      /usr/bin/ar cr /u01/app/product/11.2.0/dbhome_1/rdbms/lib/libknlopt.a /u01/app/product/11.2.0/dbhome_1/rdbms/lib/dmwdm.o
      /usr/bin/ar d /u01/app/product/11.2.0/dbhome_1/rdbms/lib/libknlopt.a xsnoolap.o
      /usr/bin/ar cr /u01/app/product/11.2.0/dbhome_1/rdbms/lib/libknlopt.a /u01/app/product/11.2.0/dbhome_1/rdbms/lib/xsyeolap.o
      /usr/bin/ar cr /u01/app/product/11.2.0/dbhome_1/rdbms/lib/libknlopt.a /u01/app/product/11.2.0/dbhome_1/rdbms/lib/kxmwsd.o
      /usr/bin/make -f ins_net_client.mk mkldflags ntcontab.o nnfgt.o ORACLE_HOME=/u01/app/product/11.2.0/dbhome_1/rm -f ntcontab.*
      (if [ "compile" = "compile" ] ; then \
      /u01/app/product/11.2.0/dbhome_1/bin/gennttab > ntcontab.c ;\
      gcc -m64 -c ntcontab.c ;\
      rm -f /u01/app/product/11.2.0/dbhome_1/lib/ntcontab.o ;\
      mv ntcontab.o /u01/app/product/11.2.0/dbhome_1/lib/ ;\
      /usr/bin/ar rv /u01/app/product/11.2.0/dbhome_1/lib/libn11.a /u01/app/product/11.2.0/dbhome_1/lib/ntcontab.o ; fi)
      /usr/libexec/gcc/x86_64-redhat-linux/4.4.4/cc1: error while loading shared libraries: libmpfr.so.1: cannot open shared object file: No such file or directory
      mv: cannot stat `ntcontab.o': No such file or directory
      /usr/bin/ar: /u01/app/product/11.2.0/dbhome_1/lib/ntcontab.o: No such file or directory
      make: *** [ntcontab.o] Error 1
      /usr/bin/make -f ins_net_client.mk mkldflags ntcontab.o nnfgt.o ORACLE_HOME=/u01/app/product/11.2.0/dbhome_1/rm -f ntcontab.*
      (if [ "compile" = "compile" ] ; then \
      /u01/app/product/11.2.0/dbhome_1/bin/gennttab > ntcontab.c ;\
      gcc -m64 -c ntcontab.c ;\
      rm -f /u01/app/product/11.2.0/dbhome_1/lib/ntcontab.o ;\
      mv ntcontab.o /u01/app/product/11.2.0/dbhome_1/lib/ ;\
      /usr/bin/ar rv /u01/app/product/11.2.0/dbhome_1/lib/libn11.a /u01/app/product/11.2.0/dbhome_1/lib/ntcontab.o ; fi)
      /usr/libexec/gcc/x86_64-redhat-linux/4.4.4/cc1: error while loading shared libraries: libmpfr.so.1: cannot open shared object file: No such file or directory
      mv: cannot stat `ntcontab.o': No such file or directory
      /usr/bin/ar: /u01/app/product/11.2.0/dbhome_1/lib/ntcontab.o: No such file or directory
      make: *** [ntcontab.o] Error 1
      ~
      ~

      Please help me to fix the same.

      Edited by: user11144536 on Apr 29, 2013 12:34 AM