This discussion is archived
2 Replies Latest reply: Jul 6, 2013 3:47 AM by Nitin Khare RSS

Cim tool throwing error 255 saying start sqlrepository unexpected

8862eaab-911c-44b7-9e27-29fc600ce303 Newbie
Currently Being Moderated
* infoSat Jul 06 13:29:13 IST 20131373097553494atg.cim.database.ImportDataTask23 Data Import: Repository:/atg/web/viewmapping/ViewMappingRepository Path:/BCC/install/data/viewmapping.xml Module:BCC
**** infoSat Jul 06 13:29:13 IST 20131373097553495atg.cim.database.ImportDataTask24 Data Import: Repository:/atg/web/viewmapping/ViewMappingRepository Path:/AssetUI/install/data/viewmapping.xml Module:AssetUI
**** infoSat Jul 06 13:29:13 IST 20131373097553495atg.cim.database.ImportDataTask25 Data Import: Repository:/atg/web/viewmapping/ViewMappingRepository Path:/AssetUI/install/data/assetManagerViews.xml Module:AssetUI
**** infoSat Jul 06 13:29:13 IST 20131373097553495atg.cim.database.ImportDataTask26 Data Import: Repository:/atg/web/viewmapping/ViewMappingRepository Path:/DPS-UI/install/data/viewmapping.xml Module:DPS-UI
**** infoSat Jul 06 13:29:13 IST 20131373097553495atg.cim.database.ImportDataTask27 Data Import: Repository:/atg/web/viewmapping/ViewMappingRepository Path:/DPS-UI/install/data/examples.xml Module:DPS-UI
**** infoSat Jul 06 13:29:13 IST 20131373097553495atg.cim.database.ImportDataTask28 Data Import: Repository:/atg/userprofiling/InternalProfileRepository Path:/SiteAdmin/Versioned/install/data/siteadmin-role-data.xml Module:DSS.InternalUsers
**** infoSat Jul 06 13:29:13 IST 20131373097553495atg.cim.database.ImportDataTask29 Data Import: Repository:/atg/userprofiling/InternalProfileRepository Path:/SiteAdmin/Versioned/install/data/users.xml Module:DSS.InternalUsers
**** infoSat Jul 06 13:29:13 IST 20131373097553496atg.cim.database.ImportDataTask30 Data Import: Repository:/atg/web/viewmapping/ViewMappingRepository Path:/SiteAdmin/Versioned/install/data/viewmapping.xml Module:SiteAdmin.Versioned
**** infoSat Jul 06 13:29:13 IST 20131373097553496atg.cim.database.ImportDataTask31 Data Import: Repository:/atg/multisite/SiteRepository Path:/SiteAdmin/Versioned/install/data/templates.xml Module:SiteAdmin.Versioned
**** infoSat Jul 06 13:29:13 IST 20131373097553496atg.cim.database.ImportDataTask32 Data Import: Repository:/atg/web/viewmapping/ViewMappingRepository Path:/DCS-UI/install/data/viewmapping.xml Module:DCS-UI
**** infoSat Jul 06 13:29:13 IST 20131373097553496atg.cim.database.ImportDataTask33 Data Import: Repository:/atg/multisite/SiteRepository Path:/CommerceReferenceStore/Store/EStore/Versioned/install/data/international-sites-templates.xml Module:Store.EStore.Versioned,Store.EStore.International
**** infoSat Jul 06 13:29:13 IST 20131373097553496atg.cim.database.ImportDataTask34 Data Import: Repository:/atg/web/viewmapping/ViewMappingRepository Path:/CommerceReferenceStore/Store/EStore/Versioned/install/data/viewmapping.xml Module:Store.EStore.Versioned,DCS-UI
**** infoSat Jul 06 13:29:13 IST 20131373097553496atg.cim.database.ImportDataTask35 Data Import: Repository:/atg/web/viewmapping/ViewMappingRepository Path:/CommerceReferenceStore/Store/EStore/Versioned/install/data/site-template-viewmapping.xml Module:SiteAdmin.Versioned,Store.EStore.Versioned
**** infoSat Jul 06 13:29:13 IST 20131373097553496atg.cim.database.ImportDataTask36 Data Import: Repository:/atg/web/viewmapping/ViewMappingRepository Path:/CommerceReferenceStore/Store/EStore/International/Versioned/install/data/viewmapping.xml Module:Store.EStore.International.Versioned,DCS-UI
**** infoSat Jul 06 13:29:13 IST 20131373097553497atg.cim.database.ImportDataTask37 Data Import: Repository:/atg/userprofiling/InternalProfileRepository Path:/DCS-UI/Versioned/install/data/users.xml Module:DCS-UI.Versioned
**** infoSat Jul 06 13:29:13 IST 20131373097553497atg.cim.database.ImportDataTask38 Data Import: Repository:/atg/web/viewmapping/ViewMappingRepository Path:/DCS-UI/Versioned/install/data/viewmapping.xml Module:DCS-UI.Versioned
**** WarningSat Jul 06 13:29:13 IST 20131373097553551atg.cim.worker.common.PropertyFileCreatorTaskAttempting to create properties file G:\ATG\ATG10.0.3\home\..\home\servers\cimDbInitializer\localconfig\atg\registry\RepositoryGroups.properties with out contents.
**** infoSat Jul 06 13:29:13 IST 20131373097553553atg.cim.worker.common.PropertyFileCreatorTaskWrote File G:\ATG\ATG10.0.3\home\..\home\servers\cimDbInitializer\localconfig\atg\registry\RepositoryGroups.properties
**** infoSat Jul 06 13:29:13 IST 20131373097553652atg.cim.worker.dynamo.StartSqlRepositoryExecutorTaskExecuting startSqlRepository for /atg/userprofiling/InternalProfileRepository
**** infoSat Jul 06 13:29:13 IST 20131373097553652atg.cim.worker.dynamo.StartSqlRepositoryExecutorTaskImport File G:\ATG\ATG10.0.3\home\..\Publishing\base\install\epub-role-data.xml
**** infoSat Jul 06 13:29:13 IST 20131373097553652atg.cim.worker.dynamo.StartSqlRepositoryExecutorTaskargs :  -workspace workspace -comment initial_data_import -user publishing
**** infoSat Jul 06 13:29:13 IST 20131373097553685atg.cim.task.ant.utility.AntLogger
**** infoSat Jul 06 13:29:13 IST 20131373097553685atg.cim.task.ant.utility.AntLoggerstart.sqlrepository.windows:
**** infoSat Jul 06 13:29:14 IST 20131373097554924atg.cim.task.ant.utility.AntLogger     [exec] & was unexpected at this time.
**** infoSat Jul 06 13:29:14 IST 20131373097554956atg.cim.task.ant.utility.AntLogger
**** infoSat Jul 06 13:29:14 IST 20131373097554956atg.cim.task.ant.utility.AntLoggerBUILD FAILED
**** infoSat Jul 06 13:29:14 IST 20131373097554956atg.cim.task.ant.utility.AntLoggerG:\ATG\ATG10.0.3\CIM\plugins\Base\ant\cim-ant.xml:4: exec returned: 255
**** infoSat Jul 06 13:29:14 IST 20131373097554956atg.cim.task.ant.utility.AntLogger
**** infoSat Jul 06 13:29:14 IST 20131373097554956atg.cim.task.ant.utility.AntLoggerTotal time: 1 second
**** ErrorSat Jul 06 13:29:14 IST 20131373097554958atg.cim.worker.dynamo.StartSqlRepositoryExecutorTask---G:\ATG\ATG10.0.3\CIM\plugins\Base\ant\cim-ant.xml:4: exec returned: 255
**** ErrorSat Jul 06 13:29:14 IST 20131373097554958atg.cim.worker.dynamo.StartSqlRepositoryExecutorTaskat org.apache.tools.ant.taskdefs.ExecTask.runExecute(ExecTask.java:636)
**** ErrorSat Jul 06 13:29:14 IST 20131373097554958atg.cim.worker.dynamo.StartSqlRepositoryExecutorTaskat org.apache.tools.ant.taskdefs.ExecTask.runExec(ExecTask.java:662)
**** ErrorSat Jul 06 13:29:14 IST 20131373097554958atg.cim.worker.dynamo.StartSqlRepositoryExecutorTaskat org.apache.tools.ant.taskdefs.ExecTask.execute(ExecTask.java:487)
**** ErrorSat Jul 06 13:29:14 IST 20131373097554958atg.cim.worker.dynamo.StartSqlRepositoryExecutorTaskat org.apache.tools.ant.UnknownElement.execute(UnknownElement.java:288)
**** ErrorSat Jul 06 13:29:14 IST 20131373097554958atg.cim.worker.dynamo.StartSqlRepositoryExecutorTaskat sun.reflect.NativeMethodAccessorImpl.invoke0(Native Method)
**** ErrorSat Jul 06 13:29:14 IST 20131373097554958atg.cim.worker.dynamo.StartSqlRepositoryExecutorTaskat sun.reflect.NativeMethodAccessorImpl.invoke(NativeMethodAccessorImpl.java:39)
**** ErrorSat Jul 06 13:29:14 IST 20131373097554958atg.cim.worker.dynamo.StartSqlRepositoryExecutorTaskat sun.reflect.DelegatingMethodAccessorImpl.invoke(DelegatingMethodAccessorImpl.java:25)
**** ErrorSat Jul 06 13:29:14 IST 20131373097554958atg.cim.worker.dynamo.StartSqlRepositoryExecutorTaskat java.lang.reflect.Method.invoke(Method.java:597)
**** ErrorSat Jul 06 13:29:14 IST 20131373097554958atg.cim.worker.dynamo.StartSqlRepositoryExecutorTaskat org.apache.tools.ant.dispatch.DispatchUtils.execute(DispatchUtils.java:105)
**** ErrorSat Jul 06 13:29:14 IST 20131373097554958atg.cim.worker.dynamo.StartSqlRepositoryExecutorTaskat org.apache.tools.ant.Task.perform(Task.java:348)
**** ErrorSat Jul 06 13:29:14 IST 20131373097554958atg.cim.worker.dynamo.StartSqlRepositoryExecutorTaskat org.apache.tools.ant.Target.execute(Target.java:357)
**** ErrorSat Jul 06 13:29:14 IST 20131373097554958atg.cim.worker.dynamo.StartSqlRepositoryExecutorTaskat org.apache.tools.ant.Target.performTasks(Target.java:385)
**** ErrorSat Jul 06 13:29:14 IST 20131373097554958atg.cim.worker.dynamo.StartSqlRepositoryExecutorTaskat org.apache.tools.ant.Project.executeSortedTargets(Project.java:1329)
**** ErrorSat Jul 06 13:29:14 IST 20131373097554958atg.cim.worker.dynamo.StartSqlRepositoryExecutorTaskat org.apache.tools.ant.Project.executeTarget(Project.java:1298)
**** ErrorSat Jul 06 13:29:14 IST 20131373097554958atg.cim.worker.dynamo.StartSqlRepositoryExecutorTaskat atg.cim.task.ant.utility.AntExecutionWrapper.executeAntTarget(AntExecutionWrapper.java:145)
**** ErrorSat Jul 06 13:29:14 IST 20131373097554958atg.cim.worker.dynamo.StartSqlRepositoryExecutorTaskat atg.cim.worker.AntTask.executeAntTarget(AntTask.java:93)
**** ErrorSat Jul 06 13:29:14 IST 20131373097554958atg.cim.worker.dynamo.StartSqlRepositoryExecutorTaskat atg.cim.worker.dynamo.StartSqlRepositoryExecutorTask.execute(StartSqlRepositoryExecutorTask.java:243)
**** ErrorSat Jul 06 13:29:14 IST 20131373097554958atg.cim.worker.dynamo.StartSqlRepositoryExecutorTaskat atg.cim.database.ImportDataTask.createStartSqlRepositoryTask(ImportDataTask.java:635)
**** ErrorSat Jul 06 13:29:14 IST 20131373097554958atg.cim.worker.dynamo.StartSqlRepositoryExecutorTaskat atg.cim.database.ImportDataTask.importTask(ImportDataTask.java:454)
**** ErrorSat Jul 06 13:29:14 IST 20131373097554958atg.cim.worker.dynamo.StartSqlRepositoryExecutorTaskat atg.cim.database.ImportDataTask.execute(ImportDataTask.java:217)
**** ErrorSat Jul 06 13:29:14 IST 20131373097554958atg.cim.worker.dynamo.StartSqlRepositoryExecutorTaskat atg.cim.task.TaskExecutor.execute(TaskExecutor.java:134)
**** ErrorSat Jul 06 13:29:14 IST 20131373097554958atg.cim.worker.dynamo.StartSqlRepositoryExecutorTaskat atg.cim.task.TaskExecutor.executeTasks(TaskExecutor.java:80)
**** ErrorSat Jul 06 13:29:14 IST 20131373097554958atg.cim.worker.dynamo.StartSqlRepositoryExecutorTaskat atg.cim.command.types.ExecuteStepTasks.execute(ExecuteStepTasks.java:51)
**** ErrorSat Jul 06 13:29:14 IST 20131373097554958atg.cim.worker.dynamo.StartSqlRepositoryExecutorTaskat atg.cim.command.CommandExecutor.execute(CommandExecutor.java:128)
**** ErrorSat Jul 06 13:29:14 IST 20131373097554958atg.cim.worker.dynamo.StartSqlRepositoryExecutorTaskat atg.cim.command.CommandExecutor.executeCommands(CommandExecutor.java:156)
**** ErrorSat Jul 06 13:29:14 IST 20131373097554958atg.cim.worker.dynamo.StartSqlRepositoryExecutorTaskat atg.cim.step.StepExecutor.executeValidations(StepExecutor.java:289)
**** ErrorSat Jul 06 13:29:14 IST 20131373097554958atg.cim.worker.dynamo.StartSqlRepositoryExecutorTaskat atg.cim.ui.text.TextDisplay.processStep(TextDisplay.java:436)
**** ErrorSat Jul 06 13:29:14 IST 20131373097554958atg.cim.worker.dynamo.StartSqlRepositoryExecutorTaskat atg.cim.ui.UIDispatchImpl.processStep(UIDispatchImpl.java:89)
**** ErrorSat Jul 06 13:29:14 IST 20131373097554958atg.cim.worker.dynamo.StartSqlRepositoryExecutorTaskat atg.cim.step.StepExecutor.processStep(StepExecutor.java:201)
**** ErrorSat Jul 06 13:29:14 IST 20131373097554958atg.cim.worker.dynamo.StartSqlRepositoryExecutorTaskat atg.cim.step.StepExecutor.processCurrentStep(StepExecutor.java:80)
**** ErrorSat Jul 06 13:29:14 IST 20131373097554958atg.cim.worker.dynamo.StartSqlRepositoryExecutorTaskat atg.cim.runner.Runner.run(Runner.java:152)
**** ErrorSat Jul 06 13:29:14 IST 20131373097554958atg.cim.worker.dynamo.StartSqlRepositoryExecutorTaskat atg.cim.command.types.LaunchTemplate.execute(LaunchTemplate.java:69)
**** ErrorSat Jul 06 13:29:14 IST 20131373097554958atg.cim.worker.dynamo.StartSqlRepositoryExecutorTaskat atg.cim.command.CommandExecutor.execute(CommandExecutor.java:128)
**** ErrorSat Jul 06 13:29:14 IST 20131373097554958atg.cim.worker.dynamo.StartSqlRepositoryExecutorTaskat atg.cim.command.CommandExecutor.executeCommands(CommandExecutor.java:156)
**** ErrorSat Jul 06 13:29:14 IST 20131373097554958atg.cim.worker.dynamo.StartSqlRepositoryExecutorTaskat atg.cim.step.StepExecutor.processStep(StepExecutor.java:129)
**** ErrorSat Jul 06 13:29:14 IST 20131373097554958atg.cim.worker.dynamo.StartSqlRepositoryExecutorTaskat atg.cim.step.StepExecutor.processCurrentStep(StepExecutor.java:80)
**** ErrorSat Jul 06 13:29:14 IST 20131373097554958atg.cim.worker.dynamo.StartSqlRepositoryExecutorTaskat atg.cim.runner.Runner.run(Runner.java:152)
**** ErrorSat Jul 06 13:29:14 IST 20131373097554958atg.cim.worker.dynamo.StartSqlRepositoryExecutorTaskat atg.cim.command.types.LaunchTemplate.execute(LaunchTemplate.java:69)
**** ErrorSat Jul 06 13:29:14 IST 20131373097554958atg.cim.worker.dynamo.StartSqlRepositoryExecutorTaskat atg.cim.command.CommandExecutor.execute(CommandExecutor.java:128)
**** ErrorSat Jul 06 13:29:14 IST 20131373097554958atg.cim.worker.dynamo.StartSqlRepositoryExecutorTaskat atg.cim.command.CommandExecutor.executeCommands(CommandExecutor.java:156)
**** ErrorSat Jul 06 13:29:14 IST 20131373097554958atg.cim.worker.dynamo.StartSqlRepositoryExecutorTaskat atg.cim.step.StepExecutor.processStep(StepExecutor.java:129)
**** ErrorSat Jul 06 13:29:14 IST 20131373097554958atg.cim.worker.dynamo.StartSqlRepositoryExecutorTaskat atg.cim.step.StepExecutor.processCurrentStep(StepExecutor.java:80)
**** ErrorSat Jul 06 13:29:14 IST 20131373097554958atg.cim.worker.dynamo.StartSqlRepositoryExecutorTaskat atg.cim.runner.Runner.run(Runner.java:152)
**** ErrorSat Jul 06 13:29:14 IST 20131373097554958atg.cim.worker.dynamo.StartSqlRepositoryExecutorTaskat atg.cim.command.types.LaunchTemplate.execute(LaunchTemplate.java:69)
**** ErrorSat Jul 06 13:29:14 IST 20131373097554958atg.cim.worker.dynamo.StartSqlRepositoryExecutorTaskat atg.cim.command.CommandExecutor.execute(CommandExecutor.java:128)
**** ErrorSat Jul 06 13:29:14 IST 20131373097554958atg.cim.worker.dynamo.StartSqlRepositoryExecutorTaskat atg.cim.command.CommandExecutor.executeCommands(CommandExecutor.java:156)
**** ErrorSat Jul 06 13:29:14 IST 20131373097554958atg.cim.worker.dynamo.StartSqlRepositoryExecutorTaskat atg.cim.step.StepExecutor.processStep(StepExecutor.java:129)
**** ErrorSat Jul 06 13:29:14 IST 20131373097554958atg.cim.worker.dynamo.StartSqlRepositoryExecutorTaskat atg.cim.step.StepExecutor.processCurrentStep(StepExecutor.java:80)
**** ErrorSat Jul 06 13:29:14 IST 20131373097554958atg.cim.worker.dynamo.StartSqlRepositoryExecutorTaskat atg.cim.runner.Runner.run(Runner.java:152)
**** ErrorSat Jul 06 13:29:14 IST 20131373097554958atg.cim.worker.dynamo.StartSqlRepositoryExecutorTaskat atg.cim.command.types.LaunchTemplate.execute(LaunchTemplate.java:69)
**** ErrorSat Jul 06 13:29:14 IST 20131373097554958atg.cim.worker.dynamo.StartSqlRepositoryExecutorTaskat atg.cim.command.CommandExecutor.execute(CommandExecutor.java:128)
**** ErrorSat Jul 06 13:29:14 IST 20131373097554958atg.cim.worker.dynamo.StartSqlRepositoryExecutorTaskat atg.cim.command.CommandExecutor.executeCommands(CommandExecutor.java:156)
**** ErrorSat Jul 06 13:29:14 IST 20131373097554958atg.cim.worker.dynamo.StartSqlRepositoryExecutorTaskat atg.cim.step.StepExecutor.processStep(StepExecutor.java:129)
**** ErrorSat Jul 06 13:29:14 IST 20131373097554958atg.cim.worker.dynamo.StartSqlRepositoryExecutorTaskat atg.cim.step.StepExecutor.processCurrentStep(StepExecutor.java:80)
**** ErrorSat Jul 06 13:29:14 IST 20131373097554958atg.cim.worker.dynamo.StartSqlRepositoryExecutorTaskat atg.cim.runner.Runner.run(Runner.java:152)
**** ErrorSat Jul 06 13:29:14 IST 20131373097554958atg.cim.worker.dynamo.StartSqlRepositoryExecutorTaskat atg.cim.command.types.LaunchWizard.execute(LaunchWizard.java:73)
**** ErrorSat Jul 06 13:29:14 IST 20131373097554958atg.cim.worker.dynamo.StartSqlRepositoryExecutorTaskat atg.cim.command.CommandExecutor.execute(CommandExecutor.java:128)
**** ErrorSat Jul 06 13:29:14 IST 20131373097554958atg.cim.worker.dynamo.StartSqlRepositoryExecutorTaskat atg.cim.command.CommandExecutor.executeCommands(CommandExecutor.java:156)
**** ErrorSat Jul 06 13:29:14 IST 20131373097554958atg.cim.worker.dynamo.StartSqlRepositoryExecutorTaskat atg.cim.step.StepExecutor.processStep(StepExecutor.java:216)
**** ErrorSat Jul 06 13:29:14 IST 20131373097554958atg.cim.worker.dynamo.StartSqlRepositoryExecutorTaskat atg.cim.step.StepExecutor.processCurrentStep(StepExecutor.java:80)
**** ErrorSat Jul 06 13:29:14 IST 20131373097554958atg.cim.worker.dynamo.StartSqlRepositoryExecutorTaskat atg.cim.runner.Runner.run(Runner.java:152)
**** ErrorSat Jul 06 13:29:14 IST 20131373097554958atg.cim.worker.dynamo.StartSqlRepositoryExecutorTaskat atg.cim.flow.CimFlow.startupFlow(CimFlow.java:69)
**** ErrorSat Jul 06 13:29:14 IST 20131373097554958atg.cim.worker.dynamo.StartSqlRepositoryExecutorTaskat atg.cim.flow.CimFlowCreator.startDefaultCimFlow(CimFlowCreator.java:78)
**** ErrorSat Jul 06 13:29:14 IST 20131373097554958atg.cim.worker.dynamo.StartSqlRepositoryExecutorTaskat atg.cim.Launcher.startCimFlow(Launcher.java:168)
**** ErrorSat Jul 06 13:29:14 IST 20131373097554958atg.cim.worker.dynamo.StartSqlRepositoryExecutorTaskat atg.cim.Launcher.main(Launcher.java:68)
**** ErrorSat Jul 06 13:29:14 IST 20131373097554958atg.cim.worker.dynamo.StartSqlRepositoryExecutorTask
**** ErrorSat Jul 06 13:29:15 IST 20131373097555078atg.cim.step.StepExecutor---atg.cim.StepException: StartSqlRepositoryTemplateStep:Error Executing Step
**** ErrorSat Jul 06 13:29:15 IST 20131373097555078atg.cim.step.StepExecutorat atg.cim.step.StepExecutor.processCurrentStep(StepExecutor.java:87)
**** ErrorSat Jul 06 13:29:15 IST 20131373097555078atg.cim.step.StepExecutorat atg.cim.runner.Runner.run(Runner.java:152)
**** ErrorSat Jul 06 13:29:15 IST 20131373097555078atg.cim.step.StepExecutorat atg.cim.command.types.LaunchTemplate.execute(LaunchTemplate.java:69)
**** ErrorSat Jul 06 13:29:15 IST 20131373097555078atg.cim.step.StepExecutorat atg.cim.command.CommandExecutor.execute(CommandExecutor.java:128)
**** ErrorSat Jul 06 13:29:15 IST 20131373097555078atg.cim.step.StepExecutorat atg.cim.command.CommandExecutor.executeCommands(CommandExecutor.java:156)
**** ErrorSat Jul 06 13:29:15 IST 20131373097555078atg.cim.step.StepExecutorat atg.cim.step.StepExecutor.processStep(StepExecutor.java:129)
**** ErrorSat Jul 06 13:29:15 IST 20131373097555078atg.cim.step.StepExecutorat atg.cim.step.StepExecutor.processCurrentStep(StepExecutor.java:80)
**** ErrorSat Jul 06 13:29:15 IST 20131373097555078atg.cim.step.StepExecutorat atg.cim.runner.Runner.run(Runner.java:152)
**** ErrorSat Jul 06 13:29:15 IST 20131373097555078atg.cim.step.StepExecutorat atg.cim.command.types.LaunchTemplate.execute(LaunchTemplate.java:69)
**** ErrorSat Jul 06 13:29:15 IST 20131373097555078atg.cim.step.StepExecutorat atg.cim.command.CommandExecutor.execute(CommandExecutor.java:128)
**** ErrorSat Jul 06 13:29:15 IST 20131373097555078atg.cim.step.StepExecutorat atg.cim.command.CommandExecutor.executeCommands(CommandExecutor.java:156)
**** ErrorSat Jul 06 13:29:15 IST 20131373097555078atg.cim.step.StepExecutorat atg.cim.step.StepExecutor.processStep(StepExecutor.java:129)
**** ErrorSat Jul 06 13:29:15 IST 20131373097555078atg.cim.step.StepExecutorat atg.cim.step.StepExecutor.processCurrentStep(StepExecutor.java:80)
**** ErrorSat Jul 06 13:29:15 IST 20131373097555078atg.cim.step.StepExecutorat atg.cim.runner.Runner.run(Runner.java:152)
**** ErrorSat Jul 06 13:29:15 IST 20131373097555078atg.cim.step.StepExecutorat atg.cim.command.types.LaunchTemplate.execute(LaunchTemplate.java:69)
**** ErrorSat Jul 06 13:29:15 IST 20131373097555078atg.cim.step.StepExecutorat atg.cim.command.CommandExecutor.execute(CommandExecutor.java:128)
**** ErrorSat Jul 06 13:29:15 IST 20131373097555078atg.cim.step.StepExecutorat atg.cim.command.CommandExecutor.executeCommands(CommandExecutor.java:156)
**** ErrorSat Jul 06 13:29:15 IST 20131373097555078atg.cim.step.StepExecutorat atg.cim.step.StepExecutor.processStep(StepExecutor.java:129)
**** ErrorSat Jul 06 13:29:15 IST 20131373097555078atg.cim.step.StepExecutorat atg.cim.step.StepExecutor.processCurrentStep(StepExecutor.java:80)
**** ErrorSat Jul 06 13:29:15 IST 20131373097555078atg.cim.step.StepExecutorat atg.cim.runner.Runner.run(Runner.java:152)
**** ErrorSat Jul 06 13:29:15 IST 20131373097555078atg.cim.step.StepExecutorat atg.cim.command.types.LaunchWizard.execute(LaunchWizard.java:73)
**** ErrorSat Jul 06 13:29:15 IST 20131373097555078atg.cim.step.StepExecutorat atg.cim.command.CommandExecutor.execute(CommandExecutor.java:128)
**** ErrorSat Jul 06 13:29:15 IST 20131373097555078atg.cim.step.StepExecutorat atg.cim.command.CommandExecutor.executeCommands(CommandExecutor.java:156)
**** ErrorSat Jul 06 13:29:15 IST 20131373097555078atg.cim.step.StepExecutorat atg.cim.step.StepExecutor.processStep(StepExecutor.java:216)
**** ErrorSat Jul 06 13:29:15 IST 20131373097555078atg.cim.step.StepExecutorat atg.cim.step.StepExecutor.processCurrentStep(StepExecutor.java:80)
**** ErrorSat Jul 06 13:29:15 IST 20131373097555078atg.cim.step.StepExecutorat atg.cim.runner.Runner.run(Runner.java:152)
**** ErrorSat Jul 06 13:29:15 IST 20131373097555078atg.cim.step.StepExecutorat atg.cim.flow.CimFlow.startupFlow(CimFlow.java:69)
**** ErrorSat Jul 06 13:29:15 IST 20131373097555078atg.cim.step.StepExecutorat atg.cim.flow.CimFlowCreator.startDefaultCimFlow(CimFlowCreator.java:78)
**** ErrorSat Jul 06 13:29:15 IST 20131373097555078atg.cim.step.StepExecutorat atg.cim.Launcher.startCimFlow(Launcher.java:168)
**** ErrorSat Jul 06 13:29:15 IST 20131373097555078atg.cim.step.StepExecutorat atg.cim.Launcher.main(Launcher.java:68)
**** ErrorSat Jul 06 13:29:15 IST 20131373097555078atg.cim.step.StepExecutorCaused by :atg.cim.StepException: StartSqlRepositoryTemplateStep:Error Executing Template
**** ErrorSat Jul 06 13:29:15 IST 20131373097555078atg.cim.step.StepExecutorat atg.cim.step.StepExecutor.processStep(StepExecutor.java:132)
**** ErrorSat Jul 06 13:29:15 IST 20131373097555078atg.cim.step.StepExecutorat atg.cim.step.StepExecutor.processCurrentStep(StepExecutor.java:80)
**** ErrorSat Jul 06 13:29:15 IST 20131373097555078atg.cim.step.StepExecutorat atg.cim.runner.Runner.run(Runner.java:152)
**** ErrorSat Jul 06 13:29:15 IST 20131373097555078atg.cim.step.StepExecutorat atg.cim.command.types.LaunchTemplate.execute(LaunchTemplate.java:69)
**** ErrorSat Jul 06 13:29:15 IST 20131373097555078atg.cim.step.StepExecutorat atg.cim.command.CommandExecutor.execute(CommandExecutor.java:128)
**** ErrorSat Jul 06 13:29:15 IST 20131373097555078atg.cim.step.StepExecutorat atg.cim.command.CommandExecutor.executeCommands(CommandExecutor.java:156)
**** ErrorSat Jul 06 13:29:15 IST 20131373097555078atg.cim.step.StepExecutorat atg.cim.step.StepExecutor.processStep(StepExecutor.java:129)
**** ErrorSat Jul 06 13:29:15 IST 20131373097555078atg.cim.step.StepExecutorat atg.cim.step.StepExecutor.processCurrentStep(StepExecutor.java:80)
**** ErrorSat Jul 06 13:29:15 IST 20131373097555078atg.cim.step.StepExecutorat atg.cim.runner.Runner.run(Runner.java:152)
**** ErrorSat Jul 06 13:29:15 IST 20131373097555078atg.cim.step.StepExecutorat atg.cim.command.types.LaunchTemplate.execute(LaunchTemplate.java:69)
**** ErrorSat Jul 06 13:29:15 IST 20131373097555078atg.cim.step.StepExecutorat atg.cim.command.CommandExecutor.execute(CommandExecutor.java:128)
**** ErrorSat Jul 06 13:29:15 IST 20131373097555078atg.cim.step.StepExecutorat atg.cim.command.CommandExecutor.executeCommands(CommandExecutor.java:156)
**** ErrorSat Jul 06 13:29:15 IST 20131373097555078atg.cim.step.StepExecutorat atg.cim.step.StepExecutor.processStep(StepExecutor.java:129)
**** ErrorSat Jul 06 13:29:15 IST 20131373097555078atg.cim.step.StepExecutorat atg.cim.step.StepExecutor.processCurrentStep(StepExecutor.java:80)
**** ErrorSat Jul 06 13:29:15 IST 20131373097555078atg.cim.step.StepExecutorat atg.cim.runner.Runner.run(Runner.java:152)
**** ErrorSat Jul 06 13:29:15 IST 20131373097555078atg.cim.step.StepExecutorat atg.cim.command.types.LaunchTemplate.execute(LaunchTemplate.java:69)
**** ErrorSat Jul 06 13:29:15 IST 20131373097555078atg.cim.step.StepExecutorat atg.cim.command.CommandExecutor.execute(CommandExecutor.java:128)
**** ErrorSat Jul 06 13:29:15 IST 20131373097555078atg.cim.step.StepExecutorat atg.cim.command.CommandExecutor.executeCommands(CommandExecutor.java:156)
**** ErrorSat Jul 06 13:29:15 IST 20131373097555078atg.cim.step.StepExecutorat atg.cim.step.StepExecutor.processStep(StepExecutor.java:129)
**** ErrorSat Jul 06 13:29:15 IST 20131373097555078atg.cim.step.StepExecutorat atg.cim.step.StepExecutor.processCurrentStep(StepExecutor.java:80)
**** ErrorSat Jul 06 13:29:15 IST 20131373097555078atg.cim.step.StepExecutorat atg.cim.runner.Runner.run(Runner.java:152)
**** ErrorSat Jul 06 13:29:15 IST 20131373097555078atg.cim.step.StepExecutorat atg.cim.command.types.LaunchWizard.execute(LaunchWizard.java:73)
**** ErrorSat Jul 06 13:29:15 IST 20131373097555078atg.cim.step.StepExecutorat atg.cim.command.CommandExecutor.execute(CommandExecutor.java:128)
**** ErrorSat Jul 06 13:29:15 IST 20131373097555078atg.cim.step.StepExecutorat atg.cim.command.CommandExecutor.executeCommands(CommandExecutor.java:156)
**** ErrorSat Jul 06 13:29:15 IST 20131373097555078atg.cim.step.StepExecutorat atg.cim.step.StepExecutor.processStep(StepExecutor.java:216)
**** ErrorSat Jul 06 13:29:15 IST 20131373097555078atg.cim.step.StepExecutorat atg.cim.step.StepExecutor.processCurrentStep(StepExecutor.java:80)
**** ErrorSat Jul 06 13:29:15 IST 20131373097555078atg.cim.step.StepExecutorat atg.cim.runner.Runner.run(Runner.java:152)
**** ErrorSat Jul 06 13:29:15 IST 20131373097555078atg.cim.step.StepExecutorat atg.cim.flow.CimFlow.startupFlow(CimFlow.java:69)
**** ErrorSat Jul 06 13:29:15 IST 20131373097555078atg.cim.step.StepExecutorat atg.cim.flow.CimFlowCreator.startDefaultCimFlow(CimFlowCreator.java:78)
**** ErrorSat Jul 06 13:29:15 IST 20131373097555078atg.cim.step.StepExecutorat atg.cim.Launcher.startCimFlow(Launcher.java:168)
**** ErrorSat Jul 06 13:29:15 IST 20131373097555078atg.cim.step.StepExecutorat atg.cim.Launcher.main(Launcher.java:68)
**** ErrorSat Jul 06 13:29:15 IST 20131373097555078atg.cim.step.StepExecutorCaused by (#2):atg.cim.CommandException: Error Executing Template
**** ErrorSat Jul 06 13:29:15 IST 20131373097555078atg.cim.step.StepExecutorat atg.cim.command.types.LaunchTemplate.execute(LaunchTemplate.java:72)
**** ErrorSat Jul 06 13:29:15 IST 20131373097555078atg.cim.step.StepExecutorat atg.cim.command.CommandExecutor.execute(CommandExecutor.java:128)
**** ErrorSat Jul 06 13:29:15 IST 20131373097555078atg.cim.step.StepExecutorat atg.cim.command.CommandExecutor.executeCommands(CommandExecutor.java:156)
**** ErrorSat Jul 06 13:29:15 IST 20131373097555078atg.cim.step.StepExecutorat atg.cim.step.StepExecutor.processStep(StepExecutor.java:129)
**** ErrorSat Jul 06 13:29:15 IST 20131373097555078atg.cim.step.StepExecutorat atg.cim.step.StepExecutor.processCurrentStep(StepExecutor.java:80)
**** ErrorSat Jul 06 13:29:15 IST 20131373097555078atg.cim.step.StepExecutorat atg.cim.runner.Runner.run(Runner.java:152)
**** ErrorSat Jul 06 13:29:15 IST 20131373097555078atg.cim.step.StepExecutorat atg.cim.command.types.LaunchTemplate.execute(LaunchTemplate.java:69)
**** ErrorSat Jul 06 13:29:15 IST 20131373097555078atg.cim.step.StepExecutorat atg.cim.command.CommandExecutor.execute(CommandExecutor.java:128)
**** ErrorSat Jul 06 13:29:15 IST 20131373097555078atg.cim.step.StepExecutorat atg.cim.command.CommandExecutor.executeCommands(CommandExecutor.java:156)
**** ErrorSat Jul 06 13:29:15 IST 20131373097555078atg.cim.step.StepExecutorat atg.cim.step.StepExecutor.processStep(StepExecutor.java:129)
**** ErrorSat Jul 06 13:29:15 IST 20131373097555078atg.cim.step.StepExecutorat atg.cim.step.StepExecutor.processCurrentStep(StepExecutor.java:80)
**** ErrorSat Jul 06 13:29:15 IST 20131373097555078atg.cim.step.StepExecutorat atg.cim.runner.Runner.run(Runner.java:152)
**** ErrorSat Jul 06 13:29:15 IST 20131373097555078atg.cim.step.StepExecutorat atg.cim.command.types.LaunchTemplate.execute(LaunchTemplate.java:69)
**** ErrorSat Jul 06 13:29:15 IST 20131373097555078atg.cim.step.StepExecutorat atg.cim.command.CommandExecutor.execute(CommandExecutor.java:128)
**** ErrorSat Jul 06 13:29:15 IST 20131373097555078atg.cim.step.StepExecutorat atg.cim.command.CommandExecutor.executeCommands(CommandExecutor.java:156)
**** ErrorSat Jul 06 13:29:15 IST 20131373097555078atg.cim.step.StepExecutorat atg.cim.step.StepExecutor.processStep(StepExecutor.java:129)
**** ErrorSat Jul 06 13:29:15 IST 20131373097555078atg.cim.step.StepExecutorat atg.cim.step.StepExecutor.processCurrentStep(StepExecutor.java:80)
**** ErrorSat Jul 06 13:29:15 IST 20131373097555078atg.cim.step.StepExecutorat atg.cim.runner.Runner.run(Runner.java:152)
**** ErrorSat Jul 06 13:29:15 IST 20131373097555078atg.cim.step.StepExecutorat atg.cim.command.types.LaunchTemplate.execute(LaunchTemplate.java:69)
**** ErrorSat Jul 06 13:29:15 IST 20131373097555078atg.cim.step.StepExecutorat atg.cim.command.CommandExecutor.execute(CommandExecutor.java:128)
**** ErrorSat Jul 06 13:29:15 IST 20131373097555078atg.cim.step.StepExecutorat atg.cim.command.CommandExecutor.executeCommands(CommandExecutor.java:156)
**** ErrorSat Jul 06 13:29:15 IST 20131373097555078atg.cim.step.StepExecutorat atg.cim.step.StepExecutor.processStep(StepExecutor.java:129)
**** ErrorSat Jul 06 13:29:15 IST 20131373097555078atg.cim.step.StepExecutorat atg.cim.step.StepExecutor.processCurrentStep(StepExecutor.java:80)
**** ErrorSat Jul 06 13:29:15 IST 20131373097555078atg.cim.step.StepExecutorat atg.cim.runner.Runner.run(Runner.java:152)
**** ErrorSat Jul 06 13:29:15 IST 20131373097555078atg.cim.step.StepExecutorat atg.cim.command.types.LaunchWizard.execute(LaunchWizard.java:73)
**** ErrorSat Jul 06 13:29:15 IST 20131373097555078atg.cim.step.StepExecutorat atg.cim.command.CommandExecutor.execute(CommandExecutor.java:128)
**** ErrorSat Jul 06 13:29:15 IST 20131373097555078atg.cim.step.StepExecutorat atg.cim.command.CommandExecutor.executeCommands(CommandExecutor.java:156)
**** ErrorSat Jul 06 13:29:15 IST 20131373097555078atg.cim.step.StepExecutorat atg.cim.step.StepExecutor.processStep(StepExecutor.java:216)
**** ErrorSat Jul 06 13:29:15 IST 20131373097555078atg.cim.step.StepExecutorat atg.cim.step.StepExecutor.processCurrentStep(StepExecutor.java:80)
**** ErrorSat Jul 06 13:29:15 IST 20131373097555078atg.cim.step.StepExecutorat atg.cim.runner.Runner.run(Runner.java:152)
**** ErrorSat Jul 06 13:29:15 IST 20131373097555078atg.cim.step.StepExecutorat atg.cim.flow.CimFlow.startupFlow(CimFlow.java:69)
**** ErrorSat Jul 06 13:29:15 IST 20131373097555078atg.cim.step.StepExecutorat atg.cim.flow.CimFlowCreator.startDefaultCimFlow(CimFlowCreator.java:78)
**** ErrorSat Jul 06 13:29:15 IST 20131373097555078atg.cim.step.StepExecutorat atg.cim.Launcher.startCimFlow(Launcher.java:168)
**** ErrorSat Jul 06 13:29:15 IST 20131373097555078atg.cim.step.StepExecutorat atg.cim.Launcher.main(Launcher.java:68)
**** ErrorSat Jul 06 13:29:15 IST 20131373097555078atg.cim.step.StepExecutorCaused by (#3):atg.cim.RunnerException: Error processing Steps.
**** ErrorSat Jul 06 13:29:15 IST 20131373097555078atg.cim.step.StepExecutorat atg.cim.runner.Runner.run(Runner.java:154)
**** ErrorSat Jul 06 13:29:15 IST 20131373097555078atg.cim.step.StepExecutorat atg.cim.command.types.LaunchTemplate.execute(LaunchTemplate.java:69)
**** ErrorSat Jul 06 13:29:15 IST 20131373097555078atg.cim.step.StepExecutorat atg.cim.command.CommandExecutor.execute(CommandExecutor.java:128)
**** ErrorSat Jul 06 13:29:15 IST 20131373097555078atg.cim.step.StepExecutorat atg.cim.command.CommandExecutor.executeCommands(CommandExecutor.java:156)
**** ErrorSat Jul 06 13:29:15 IST 20131373097555078atg.cim.step.StepExecutorat atg.cim.step.StepExecutor.processStep(StepExecutor.java:129)
**** ErrorSat Jul 06 13:29:15 IST 20131373097555078atg.cim.step.StepExecutorat atg.cim.step.StepExecutor.processCurrentStep(StepExecutor.java:80)
**** ErrorSat Jul 06 13:29:15 IST 20131373097555078atg.cim.step.StepExecutorat atg.cim.runner.Runner.run(Runner.java:152)
**** ErrorSat Jul 06 13:29:15 IST 20131373097555078atg.cim.step.StepExecutorat atg.cim.command.types.LaunchTemplate.execute(LaunchTemplate.java:69)
**** ErrorSat Jul 06 13:29:15 IST 20131373097555078atg.cim.step.StepExecutorat atg.cim.command.CommandExecutor.execute(CommandExecutor.java:128)
**** ErrorSat Jul 06 13:29:15 IST 20131373097555078atg.cim.step.StepExecutorat atg.cim.command.CommandExecutor.executeCommands(CommandExecutor.java:156)
**** ErrorSat Jul 06 13:29:15 IST 20131373097555078atg.cim.step.StepExecutorat atg.cim.step.StepExecutor.processStep(StepExecutor.java:129)
**** ErrorSat Jul 06 13:29:15 IST 20131373097555078atg.cim.step.StepExecutorat atg.cim.step.StepExecutor.processCurrentStep(StepExecutor.java:80)
**** ErrorSat Jul 06 13:29:15 IST 20131373097555078atg.cim.step.StepExecutorat atg.cim.runner.Runner.run(Runner.java:152)
**** ErrorSat Jul 06 13:29:15 IST 20131373097555078atg.cim.step.StepExecutorat atg.cim.command.types.LaunchTemplate.execute(LaunchTemplate.java:69)
**** ErrorSat Jul 06 13:29:15 IST 20131373097555078atg.cim.step.StepExecutorat atg.cim.command.CommandExecutor.execute(CommandExecutor.java:128)
**** ErrorSat Jul 06 13:29:15 IST 20131373097555078atg.cim.step.StepExecutorat atg.cim.command.CommandExecutor.executeCommands(CommandExecutor.java:156)
**** ErrorSat Jul 06 13:29:15 IST 20131373097555078atg.cim.step.StepExecutorat atg.cim.step.StepExecutor.processStep(StepExecutor.java:129)
**** ErrorSat Jul 06 13:29:15 IST 20131373097555078atg.cim.step.StepExecutorat atg.cim.step.StepExecutor.processCurrentStep(StepExecutor.java:80)
**** ErrorSat Jul 06 13:29:15 IST 20131373097555078atg.cim.step.StepExecutorat atg.cim.runner.Runner.run(Runner.java:152)
**** ErrorSat Jul 06 13:29:15 IST 20131373097555078atg.cim.step.StepExecutorat atg.cim.command.types.LaunchTemplate.execute(LaunchTemplate.java:69)
**** ErrorSat Jul 06 13:29:15 IST 20131373097555078atg.cim.step.StepExecutorat atg.cim.command.CommandExecutor.execute(CommandExecutor.java:128)
**** ErrorSat Jul 06 13:29:15 IST 20131373097555078atg.cim.step.StepExecutorat atg.cim.command.CommandExecutor.executeCommands(CommandExecutor.java:156)
**** ErrorSat Jul 06 13:29:15 IST 20131373097555078atg.cim.step.StepExecutorat atg.cim.step.StepExecutor.processStep(StepExecutor.java:129)
**** ErrorSat Jul 06 13:29:15 IST 20131373097555078atg.cim.step.StepExecutorat atg.cim.step.StepExecutor.processCurrentStep(StepExecutor.java:80)
**** ErrorSat Jul 06 13:29:15 IST 20131373097555078atg.cim.step.StepExecutorat atg.cim.runner.Runner.run(Runner.java:152)
**** ErrorSat Jul 06 13:29:15 IST 20131373097555078atg.cim.step.StepExecutorat atg.cim.command.types.LaunchWizard.execute(LaunchWizard.java:73)
**** ErrorSat Jul 06 13:29:15 IST 20131373097555078atg.cim.step.StepExecutorat atg.cim.command.CommandExecutor.execute(CommandExecutor.java:128)
**** ErrorSat Jul 06 13:29:15 IST 20131373097555078atg.cim.step.StepExecutorat atg.cim.command.CommandExecutor.executeCommands(CommandExecutor.java:156)
**** ErrorSat Jul 06 13:29:15 IST 20131373097555078atg.cim.step.StepExecutorat atg.cim.step.StepExecutor.processStep(StepExecutor.java:216)
**** ErrorSat Jul 06 13:29:15 IST 20131373097555078atg.cim.step.StepExecutorat atg.cim.step.StepExecutor.processCurrentStep(StepExecutor.java:80)
**** ErrorSat Jul 06 13:29:15 IST 20131373097555078atg.cim.step.StepExecutorat atg.cim.runner.Runner.run(Runner.java:152)
**** ErrorSat Jul 06 13:29:15 IST 20131373097555078atg.cim.step.StepExecutorat atg.cim.flow.CimFlow.startupFlow(CimFlow.java:69)
**** ErrorSat Jul 06 13:29:15 IST 20131373097555078atg.cim.step.StepExecutorat atg.cim.flow.CimFlowCreator.startDefaultCimFlow(CimFlowCreator.java:78)
**** ErrorSat Jul 06 13:29:15 IST 20131373097555078atg.cim.step.StepExecutorat atg.cim.Launcher.startCimFlow(Launcher.java:168)
**** ErrorSat Jul 06 13:29:15 IST 20131373097555078atg.cim.step.StepExecutorat atg.cim.Launcher.main(Launcher.java:68)
**** ErrorSat Jul 06 13:29:15 IST 20131373097555078atg.cim.step.StepExecutorCaused by (#4):atg.cim.StepException: managementImportStep:Error Executing Step
**** ErrorSat Jul 06 13:29:15 IST 20131373097555078atg.cim.step.StepExecutorat atg.cim.step.StepExecutor.processCurrentStep(StepExecutor.java:97)
**** ErrorSat Jul 06 13:29:15 IST 20131373097555078atg.cim.step.StepExecutorat atg.cim.runner.Runner.run(Runner.java:152)
**** ErrorSat Jul 06 13:29:15 IST 20131373097555078atg.cim.step.StepExecutorat atg.cim.command.types.LaunchTemplate.execute(LaunchTemplate.java:69)
**** ErrorSat Jul 06 13:29:15 IST 20131373097555078atg.cim.step.StepExecutorat atg.cim.command.CommandExecutor.execute(CommandExecutor.java:128)
**** ErrorSat Jul 06 13:29:15 IST 20131373097555078atg.cim.step.StepExecutorat atg.cim.command.CommandExecutor.executeCommands(CommandExecutor.java:156)
**** ErrorSat Jul 06 13:29:15 IST 20131373097555078atg.cim.step.StepExecutorat atg.cim.step.StepExecutor.processStep(StepExecutor.java:129)
**** ErrorSat Jul 06 13:29:15 IST 20131373097555078atg.cim.step.StepExecutorat atg.cim.step.StepExecutor.processCurrentStep(StepExecutor.java:80)
**** ErrorSat Jul 06 13:29:15 IST 20131373097555078atg.cim.step.StepExecutorat atg.cim.runner.Runner.run(Runner.java:152)
**** ErrorSat Jul 06 13:29:15 IST 20131373097555078atg.cim.step.StepExecutorat atg.cim.command.types.LaunchTemplate.execute(LaunchTemplate.java:69)
**** ErrorSat Jul 06 13:29:15 IST 20131373097555078atg.cim.step.StepExecutorat atg.cim.command.CommandExecutor.execute(CommandExecutor.java:128)
**** ErrorSat Jul 06 13:29:15 IST 20131373097555078atg.cim.step.StepExecutorat atg.cim.command.CommandExecutor.executeCommands(CommandExecutor.java:156)
**** ErrorSat Jul 06 13:29:15 IST 20131373097555078atg.cim.step.StepExecutorat atg.cim.step.StepExecutor.processStep(StepExecutor.java:129)
**** ErrorSat Jul 06 13:29:15 IST 20131373097555078atg.cim.step.StepExecutorat atg.cim.step.StepExecutor.processCurrentStep(StepExecutor.java:80)
**** ErrorSat Jul 06 13:29:15 IST 20131373097555078atg.cim.step.StepExecutorat atg.cim.runner.Runner.run(Runner.java:152)
**** ErrorSat Jul 06 13:29:15 IST 20131373097555078atg.cim.step.StepExecutorat atg.cim.command.types.LaunchTemplate.execute(LaunchTemplate.java:69)
**** ErrorSat Jul 06 13:29:15 IST 20131373097555078atg.cim.step.StepExecutorat atg.cim.command.CommandExecutor.execute(CommandExecutor.java:128)
**** ErrorSat Jul 06 13:29:15 IST 20131373097555078atg.cim.step.StepExecutorat atg.cim.command.CommandExecutor.executeCommands(CommandExecutor.java:156)
**** ErrorSat Jul 06 13:29:15 IST 20131373097555078atg.cim.step.StepExecutorat atg.cim.step.StepExecutor.processStep(StepExecutor.java:129)
**** ErrorSat Jul 06 13:29:15 IST 20131373097555078atg.cim.step.StepExecutorat atg.cim.step.StepExecutor.processCurrentStep(StepExecutor.java:80)
**** ErrorSat Jul 06 13:29:15 IST 20131373097555078atg.cim.step.StepExecutorat atg.cim.runner.Runner.run(Runner.java:152)
**** ErrorSat Jul 06 13:29:15 IST 20131373097555078atg.cim.step.StepExecutorat atg.cim.command.types.LaunchTemplate.execute(LaunchTemplate.java:69)
**** ErrorSat Jul 06 13:29:15 IST 20131373097555078atg.cim.step.StepExecutorat atg.cim.command.CommandExecutor.execute(CommandExecutor.java:128)
**** ErrorSat Jul 06 13:29:15 IST 20131373097555078atg.cim.step.StepExecutorat atg.cim.command.CommandExecutor.executeCommands(CommandExecutor.java:156)
**** ErrorSat Jul 06 13:29:15 IST 20131373097555078atg.cim.step.StepExecutorat atg.cim.step.StepExecutor.processStep(StepExecutor.java:129)
**** ErrorSat Jul 06 13:29:15 IST 20131373097555078atg.cim.step.StepExecutorat atg.cim.step.StepExecutor.processCurrentStep(StepExecutor.java:80)
**** ErrorSat Jul 06 13:29:15 IST 20131373097555078atg.cim.step.StepExecutorat atg.cim.runner.Runner.run(Runner.java:152)
**** ErrorSat Jul 06 13:29:15 IST 20131373097555078atg.cim.step.StepExecutorat atg.cim.command.types.LaunchWizard.execute(LaunchWizard.java:73)
**** ErrorSat Jul 06 13:29:15 IST 20131373097555078atg.cim.step.StepExecutorat atg.cim.command.CommandExecutor.execute(CommandExecutor.java:128)
**** ErrorSat Jul 06 13:29:15 IST 20131373097555078atg.cim.step.StepExecutorat atg.cim.command.CommandExecutor.executeCommands(CommandExecutor.java:156)
**** ErrorSat Jul 06 13:29:15 IST 20131373097555078atg.cim.step.StepExecutorat atg.cim.step.StepExecutor.processStep(StepExecutor.java:216)
**** ErrorSat Jul 06 13:29:15 IST 20131373097555078atg.cim.step.StepExecutorat atg.cim.step.StepExecutor.processCurrentStep(StepExecutor.java:80)
**** ErrorSat Jul 06 13:29:15 IST 20131373097555078atg.cim.step.StepExecutorat atg.cim.runner.Runner.run(Runner.java:152)
**** ErrorSat Jul 06 13:29:15 IST 20131373097555078atg.cim.step.StepExecutorat atg.cim.flow.CimFlow.startupFlow(CimFlow.java:69)
**** ErrorSat Jul 06 13:29:15 IST 20131373097555078atg.cim.step.StepExecutorat atg.cim.flow.CimFlowCreator.startDefaultCimFlow(CimFlowCreator.java:78)
**** ErrorSat Jul 06 13:29:15 IST 20131373097555078atg.cim.step.StepExecutorat atg.cim.Launcher.startCimFlow(Launcher.java:168)
**** ErrorSat Jul 06 13:29:15 IST 20131373097555078atg.cim.step.StepExecutorat atg.cim.Launcher.main(Launcher.java:68)
**** ErrorSat Jul 06 13:29:15 IST 20131373097555078atg.cim.step.StepExecutorCaused by (#5):atg.cim.StepException: managementImportStep:Error Executing Pre Navigation Validation
**** ErrorSat Jul 06 13:29:15 IST 20131373097555078atg.cim.step.StepExecutorat atg.cim.ui.text.TextDisplay.processStep(TextDisplay.java:438)
**** ErrorSat Jul 06 13:29:15 IST 20131373097555078atg.cim.step.StepExecutorat atg.cim.ui.UIDispatchImpl.processStep(UIDispatchImpl.java:89)
**** ErrorSat Jul 06 13:29:15 IST 20131373097555078atg.cim.step.StepExecutorat atg.cim.step.StepExecutor.processStep(StepExecutor.java:201)
**** ErrorSat Jul 06 13:29:15 IST 20131373097555078atg.cim.step.StepExecutorat atg.cim.step.StepExecutor.processCurrentStep(StepExecutor.java:80)
**** ErrorSat Jul 06 13:29:15 IST 20131373097555078atg.cim.step.StepExecutorat atg.cim.runner.Runner.run(Runner.java:152)
**** ErrorSat Jul 06 13:29:15 IST 20131373097555078atg.cim.step.StepExecutorat atg.cim.command.types.LaunchTemplate.execute(LaunchTemplate.java:69)
**** ErrorSat Jul 06 13:29:15 IST 20131373097555078atg.cim.step.StepExecutorat atg.cim.command.CommandExecutor.execute(CommandExecutor.java:128)
**** ErrorSat Jul 06 13:29:15 IST 20131373097555078atg.cim.step.StepExecutorat atg.cim.command.CommandExecutor.executeCommands(CommandExecutor.java:156)
**** ErrorSat Jul 06 13:29:15 IST 20131373097555078atg.cim.step.StepExecutorat atg.cim.step.StepExecutor.processStep(StepExecutor.java:129)
**** ErrorSat Jul 06 13:29:15 IST 20131373097555078atg.cim.step.StepExecutorat atg.cim.step.StepExecutor.processCurrentStep(StepExecutor.java:80)
**** ErrorSat Jul 06 13:29:15 IST 20131373097555078atg.cim.step.StepExecutorat atg.cim.runner.Runner.run(Runner.java:152)
**** ErrorSat Jul 06 13:29:15 IST 20131373097555078atg.cim.step.StepExecutorat atg.cim.command.types.LaunchTemplate.execute(LaunchTemplate.java:69)
**** ErrorSat Jul 06 13:29:15 IST 20131373097555078atg.cim.step.StepExecutorat atg.cim.command.CommandExecutor.execute(CommandExecutor.java:128)
**** ErrorSat Jul 06 13:29:15 IST 20131373097555078atg.cim.step.StepExecutorat atg.cim.command.CommandExecutor.executeCommands(CommandExecutor.java:156)
**** ErrorSat Jul 06 13:29:15 IST 20131373097555078atg.cim.step.StepExecutorat atg.cim.step.StepExecutor.processStep(StepExecutor.java:129)
**** ErrorSat Jul 06 13:29:15 IST 20131373097555078atg.cim.step.StepExecutorat atg.cim.step.StepExecutor.processCurrentStep(StepExecutor.java:80)
**** ErrorSat Jul 06 13:29:15 IST 20131373097555078atg.cim.step.StepExecutorat atg.cim.runner.Runner.run(Runner.java:152)
**** ErrorSat Jul 06 13:29:15 IST 20131373097555078atg.cim.step.StepExecutorat atg.cim.command.types.LaunchTemplate.execute(LaunchTemplate.java:69)
**** ErrorSat Jul 06 13:29:15 IST 20131373097555078atg.cim.step.StepExecutorat atg.cim.command.CommandExecutor.execute(CommandExecutor.java:128)
**** ErrorSat Jul 06 13:29:15 IST 20131373097555078atg.cim.step.StepExecutorat atg.cim.command.CommandExecutor.executeCommands(CommandExecutor.java:156)
**** ErrorSat Jul 06 13:29:15 IST 20131373097555078atg.cim.step.StepExecutorat atg.cim.step.StepExecutor.processStep(StepExecutor.java:129)
**** ErrorSat Jul 06 13:29:15 IST 20131373097555078atg.cim.step.StepExecutorat atg.cim.step.StepExecutor.processCurrentStep(StepExecutor.java:80)
**** ErrorSat Jul 06 13:29:15 IST 20131373097555078atg.cim.step.StepExecutorat atg.cim.runner.Runner.run(Runner.java:152)
**** ErrorSat Jul 06 13:29:15 IST 20131373097555078atg.cim.step.StepExecutorat atg.cim.command.types.LaunchTemplate.execute(LaunchTemplate.java:69)
**** ErrorSat Jul 06 13:29:15 IST 20131373097555078atg.cim.step.StepExecutorat atg.cim.command.CommandExecutor.execute(CommandExecutor.java:128)
**** ErrorSat Jul 06 13:29:15 IST 20131373097555078atg.cim.step.StepExecutorat atg.cim.command.CommandExecutor.executeCommands(CommandExecutor.java:156)
**** ErrorSat Jul 06 13:29:15 IST 20131373097555078atg.cim.step.StepExecutorat atg.cim.step.StepExecutor.processStep(StepExecutor.java:129)
**** ErrorSat Jul 06 13:29:15 IST 20131373097555078atg.cim.step.StepExecutorat atg.cim.step.StepExecutor.processCurrentStep(StepExecutor.java:80)
**** ErrorSat Jul 06 13:29:15 IST 20131373097555078atg.cim.step.StepExecutorat atg.cim.runner.Runner.run(Runner.java:152)
**** ErrorSat Jul 06 13:29:15 IST 20131373097555078atg.cim.step.StepExecutorat atg.cim.command.types.LaunchWizard.execute(LaunchWizard.java:73)
**** ErrorSat Jul 06 13:29:15 IST 20131373097555078atg.cim.step.StepExecutorat atg.cim.command.CommandExecutor.execute(CommandExecutor.java:128)
**** ErrorSat Jul 06 13:29:15 IST 20131373097555078atg.cim.step.StepExecutorat atg.cim.command.CommandExecutor.executeCommands(CommandExecutor.java:156)
**** ErrorSat Jul 06 13:29:15 IST 20131373097555078atg.cim.step.StepExecutorat atg.cim.step.StepExecutor.processStep(StepExecutor.java:216)
**** ErrorSat Jul 06 13:29:15 IST 20131373097555078atg.cim.step.StepExecutorat atg.cim.step.StepExecutor.processCurrentStep(StepExecutor.java:80)
**** ErrorSat Jul 06 13:29:15 IST 20131373097555078atg.cim.step.StepExecutorat atg.cim.runner.Runner.run(Runner.java:152)
**** ErrorSat Jul 06 13:29:15 IST 20131373097555078atg.cim.step.StepExecutorat atg.cim.flow.CimFlow.startupFlow(CimFlow.java:69)
**** ErrorSat Jul 06 13:29:15 IST 20131373097555078atg.cim.step.StepExecutorat atg.cim.flow.CimFlowCreator.startDefaultCimFlow(CimFlowCreator.java:78)
**** ErrorSat Jul 06 13:29:15 IST 20131373097555078atg.cim.step.StepExecutorat atg.cim.Launcher.startCimFlow(Launcher.java:168)
**** ErrorSat Jul 06 13:29:15 IST 20131373097555078atg.cim.step.StepExecutorat atg.cim.Launcher.main(Launcher.java:68)
**** ErrorSat Jul 06 13:29:15 IST 20131373097555078atg.cim.step.StepExecutorCaused by (#6):atg.cim.ValidatorExecutionException: AlwaysTrueValidator:Error Executing Validator Commands
**** ErrorSat Jul 06 13:29:15 IST 20131373097555078atg.cim.step.StepExecutorat atg.cim.step.StepExecutor.executeValidations(StepExecutor.java:322)
**** ErrorSat Jul 06 13:29:15 IST 20131373097555078atg.cim.step.StepExecutorat atg.cim.ui.text.TextDisplay.processStep(TextDisplay.java:436)
**** ErrorSat Jul 06 13:29:15 IST 20131373097555078atg.cim.step.StepExecutorat atg.cim.ui.UIDispatchImpl.processStep(UIDispatchImpl.java:89)
**** ErrorSat Jul 06 13:29:15 IST 20131373097555078atg.cim.step.StepExecutorat atg.cim.step.StepExecutor.processStep(StepExecutor.java:201)
**** ErrorSat Jul 06 13:29:15 IST 20131373097555078atg.cim.step.StepExecutorat atg.cim.step.StepExecutor.processCurrentStep(StepExecutor.java:80)
**** ErrorSat Jul 06 13:29:15 IST 20131373097555078atg.cim.step.StepExecutorat atg.cim.runner.Runner.run(Runner.java:152)
**** ErrorSat Jul 06 13:29:15 IST 20131373097555078atg.cim.step.StepExecutorat atg.cim.command.types.LaunchTemplate.execute(LaunchTemplate.java:69)
**** ErrorSat Jul 06 13:29:15 IST 20131373097555078atg.cim.step.StepExecutorat atg.cim.command.CommandExecutor.execute(CommandExecutor.java:128)
**** ErrorSat Jul 06 13:29:15 IST 20131373097555078atg.cim.step.StepExecutorat atg.cim.command.CommandExecutor.executeCommands(CommandExecutor.java:156)
**** ErrorSat Jul 06 13:29:15 IST 20131373097555078atg.cim.step.StepExecutorat atg.cim.step.StepExecutor.processStep(StepExecutor.java:129)
**** ErrorSat Jul 06 13:29:15 IST 20131373097555078atg.cim.step.StepExecutorat atg.cim.step.StepExecutor.processCurrentStep(StepExecutor.java:80)
**** ErrorSat Jul 06 13:29:15 IST 20131373097555078atg.cim.step.StepExecutorat atg.cim.runner.Runner.run(Runner.java:152)
**** ErrorSat Jul 06 13:29:15 IST 20131373097555078atg.cim.step.StepExecutorat atg.cim.command.types.LaunchTemplate.execute(LaunchTemplate.java:69)
**** ErrorSat Jul 06 13:29:15 IST 20131373097555078atg.cim.step.StepExecutorat atg.cim.command.CommandExecutor.execute(CommandExecutor.java:128)
**** ErrorSat Jul 06 13:29:15 IST 20131373097555078atg.cim.step.StepExecutorat atg.cim.command.CommandExecutor.executeCommands(CommandExecutor.java:156)
**** ErrorSat Jul 06 13:29:15 IST 20131373097555078atg.cim.step.StepExecutorat atg.cim.step.StepExecutor.processStep(StepExecutor.java:129)
**** ErrorSat Jul 06 13:29:15 IST 20131373097555078atg.cim.step.StepExecutorat atg.cim.step.StepExecutor.processCurrentStep(StepExecutor.java:80)
**** ErrorSat Jul 06 13:29:15 IST 20131373097555078atg.cim.step.StepExecutorat atg.cim.runner.Runner.run(Runner.java:152)
**** ErrorSat Jul 06 13:29:15 IST 20131373097555078atg.cim.step.StepExecutorat atg.cim.command.types.LaunchTemplate.execute(LaunchTemplate.java:69)
**** ErrorSat Jul 06 13:29:15 IST 20131373097555078atg.cim.step.StepExecutorat atg.cim.command.CommandExecutor.execute(CommandExecutor.java:128)
**** ErrorSat Jul 06 13:29:15 IST 20131373097555078atg.cim.step.StepExecutorat atg.cim.command.CommandExecutor.executeCommands(CommandExecutor.java:156)
**** ErrorSat Jul 06 13:29:15 IST 20131373097555078atg.cim.step.StepExecutorat atg.cim.step.StepExecutor.processStep(StepExecutor.java:129)
**** ErrorSat Jul 06 13:29:15 IST 20131373097555078atg.cim.step.StepExecutorat atg.cim.step.StepExecutor.processCurrentStep(StepExecutor.java:80)
**** ErrorSat Jul 06 13:29:15 IST 20131373097555078atg.cim.step.StepExecutorat atg.cim.runner.Runner.run(Runner.java:152)
**** ErrorSat Jul 06 13:29:15 IST 20131373097555078atg.cim.step.StepExecutorat atg.cim.command.types.LaunchTemplate.execute(LaunchTemplate.java:69)
**** ErrorSat Jul 06 13:29:15 IST 20131373097555078atg.cim.step.StepExecutorat atg.cim.command.CommandExecutor.execute(CommandExecutor.java:128)
**** ErrorSat Jul 06 13:29:15 IST 20131373097555078atg.cim.step.StepExecutorat atg.cim.command.CommandExecutor.executeCommands(CommandExecutor.java:156)
**** ErrorSat Jul 06 13:29:15 IST 20131373097555078atg.cim.step.StepExecutorat atg.cim.step.StepExecutor.processStep(StepExecutor.java:129)
**** ErrorSat Jul 06 13:29:15 IST 20131373097555078atg.cim.step.StepExecutorat atg.cim.step.StepExecutor.processCurrentStep(StepExecutor.java:80)
**** ErrorSat Jul 06 13:29:15 IST 20131373097555078atg.cim.step.StepExecutorat atg.cim.runner.Runner.run(Runner.java:152)
**** ErrorSat Jul 06 13:29:15 IST 20131373097555078atg.cim.step.StepExecutorat atg.cim.command.types.LaunchWizard.execute(LaunchWizard.java:73)
**** ErrorSat Jul 06 13:29:15 IST 20131373097555078atg.cim.step.StepExecutorat atg.cim.command.CommandExecutor.execute(CommandExecutor.java:128)
**** ErrorSat Jul 06 13:29:15 IST 20131373097555078atg.cim.step.StepExecutorat atg.cim.command.CommandExecutor.executeCommands(CommandExecutor.java:156)
**** ErrorSat Jul 06 13:29:15 IST 20131373097555078atg.cim.step.StepExecutorat atg.cim.step.StepExecutor.processStep(StepExecutor.java:216)
**** ErrorSat Jul 06 13:29:15 IST 20131373097555078atg.cim.step.StepExecutorat atg.cim.step.StepExecutor.processCurrentStep(StepExecutor.java:80)
**** ErrorSat Jul 06 13:29:15 IST 20131373097555078atg.cim.step.StepExecutorat atg.cim.runner.Runner.run(Runner.java:152)
**** ErrorSat Jul 06 13:29:15 IST 20131373097555078atg.cim.step.StepExecutorat atg.cim.flow.CimFlow.startupFlow(CimFlow.java:69)
**** ErrorSat Jul 06 13:29:15 IST 20131373097555078atg.cim.step.StepExecutorat atg.cim.flow.CimFlowCreator.startDefaultCimFlow(CimFlowCreator.java:78)
**** ErrorSat Jul 06 13:29:15 IST 20131373097555078atg.cim.step.StepExecutorat atg.cim.Launcher.startCimFlow(Launcher.java:168)
**** ErrorSat Jul 06 13:29:15 IST 20131373097555078atg.cim.step.StepExecutorat atg.cim.Launcher.main(Launcher.java:68)
**** ErrorSat Jul 06 13:29:15 IST 20131373097555078atg.cim.step.StepExecutorCaused by (#7):atg.cim.CommandException: Error Executing Step Tasks
**** ErrorSat Jul 06 13:29:15 IST 20131373097555078atg.cim.step.StepExecutorat atg.cim.command.types.ExecuteStepTasks.execute(ExecuteStepTasks.java:54)
**** ErrorSat Jul 06 13:29:15 IST 20131373097555078atg.cim.step.StepExecutorat atg.cim.command.CommandExecutor.execute(CommandExecutor.java:128)
**** ErrorSat Jul 06 13:29:15 IST 20131373097555078atg.cim.step.StepExecutorat atg.cim.command.CommandExecutor.executeCommands(CommandExecutor.java:156)
**** ErrorSat Jul 06 13:29:15 IST 20131373097555078atg.cim.step.StepExecutorat atg.cim.step.StepExecutor.executeValidations(StepExecutor.java:289)
**** ErrorSat Jul 06 13:29:15 IST 20131373097555078atg.cim.step.StepExecutorat atg.cim.ui.text.TextDisplay.processStep(TextDisplay.java:436)
**** ErrorSat Jul 06 13:29:15 IST 20131373097555078atg.cim.step.StepExecutorat atg.cim.ui.UIDispatchImpl.processStep(UIDispatchImpl.java:89)
**** ErrorSat Jul 06 13:29:15 IST 20131373097555078atg.cim.step.StepExecutorat atg.cim.step.StepExecutor.processStep(StepExecutor.java:201)
**** ErrorSat Jul 06 13:29:15 IST 20131373097555078atg.cim.step.StepExecutorat atg.cim.step.StepExecutor.processCurrentStep(StepExecutor.java:80)
**** ErrorSat Jul 06 13:29:15 IST 20131373097555078atg.cim.step.StepExecutorat atg.cim.runner.Runner.run(Runner.java:152)
**** ErrorSat Jul 06 13:29:15 IST 20131373097555078atg.cim.step.StepExecutorat atg.cim.command.types.LaunchTemplate.execute(LaunchTemplate.java:69)
**** ErrorSat Jul 06 13:29:15 IST 20131373097555078atg.cim.step.StepExecutorat atg.cim.command.CommandExecutor.execute(CommandExecutor.java:128)
**** ErrorSat Jul 06 13:29:15 IST 20131373097555078atg.cim.step.StepExecutorat atg.cim.command.CommandExecutor.executeCommands(CommandExecutor.java:156)
**** ErrorSat Jul 06 13:29:15 IST 20131373097555078atg.cim.step.StepExecutorat atg.cim.step.StepExecutor.processStep(StepExecutor.java:129)
**** ErrorSat Jul 06 13:29:15 IST 20131373097555078atg.cim.step.StepExecutorat atg.cim.step.StepExecutor.processCurrentStep(StepExecutor.java:80)
**** ErrorSat Jul 06 13:29:15 IST 20131373097555078atg.cim.step.StepExecutorat atg.cim.runner.Runner.run(Runner.java:152)
**** ErrorSat Jul 06 13:29:15 IST 20131373097555078atg.cim.step.StepExecutorat atg.cim.command.types.LaunchTemplate.execute(LaunchTemplate.java:69)
**** ErrorSat Jul 06 13:29:15 IST 20131373097555078atg.cim.step.StepExecutorat atg.cim.command.CommandExecutor.execute(CommandExecutor.java:128)
**** ErrorSat Jul 06 13:29:15 IST 20131373097555078atg.cim.step.StepExecutorat atg.cim.command.CommandExecutor.executeCommands(CommandExecutor.java:156)
**** ErrorSat Jul 06 13:29:15 IST 20131373097555078atg.cim.step.StepExecutorat atg.cim.step.StepExecutor.processStep(StepExecutor.java:129)
**** ErrorSat Jul 06 13:29:15 IST 20131373097555078atg.cim.step.StepExecutorat atg.cim.step.StepExecutor.processCurrentStep(StepExecutor.java:80)
**** ErrorSat Jul 06 13:29:15 IST 20131373097555078atg.cim.step.StepExecutorat atg.cim.runner.Runner.run(Runner.java:152)
**** ErrorSat Jul 06 13:29:15 IST 20131373097555078atg.cim.step.StepExecutorat atg.cim.command.types.LaunchTemplate.execute(LaunchTemplate.java:69)
**** ErrorSat Jul 06 13:29:15 IST 20131373097555078atg.cim.step.StepExecutorat atg.cim.command.CommandExecutor.execute(CommandExecutor.java:128)
**** ErrorSat Jul 06 13:29:15 IST 20131373097555078atg.cim.step.StepExecutorat atg.cim.command.CommandExecutor.executeCommands(CommandExecutor.java:156)
**** ErrorSat Jul 06 13:29:15 IST 20131373097555078atg.cim.step.StepExecutorat atg.cim.step.StepExecutor.processStep(StepExecutor.java:129)
**** ErrorSat Jul 06 13:29:15 IST 20131373097555078atg.cim.step.StepExecutorat atg.cim.step.StepExecutor.processCurrentStep(StepExecutor.java:80)

Legend

  • Correct Answers - 10 points
  • Helpful Answers - 5 points