4 Replies Latest reply: Aug 13, 2013 4:55 AM by ;) ApPsMasTi ;) RSS

    Relink of module "adadmin" failed.

    Mohammed Abdul Muqeet

      Dear Experts,

      Kindly note that Am In a process of doing the upgrade from R12.1.1 to R12.1.3. While applying the patch 9239089 I have noticed the adrelnking error.

      My Operating system is Redhat Linux 6 update 4 & it is x86-64bit OS. Could you please go through the below error and advise me ASAP.

       

      Relinking module 'adadmin' in product ad ...

       

      make -f

      /oracle/apps/apps_st/appl/admin/CDV1EBS1/out/link_ad_21703.mk

      /oracle/apps/apps_st/appl/ad/12.0.0/bin/adadmin

       

      Starting  link of ad executable 'adadmin' on Mon Aug 12 21:30:24 WAT 2013

      gcc -m32 -s -L/oracle/apps/tech_st/10.1.2/lib/stubs

      -L/oracle/apps/tech_st/10.1.2/lib -ldl  -o

      /oracle/apps/apps_st/appl/ad/12.0.0/bin/adadmin.new \

                     

      /oracle/apps/apps_st/appl/ad/12.0.0/lib/adadmin.o \

                                      /oracle/apps/apps_st/appl/ad/12.0.0/lib/libad.a

      /oracle/apps/apps_st/appl/fnd/12.0.0/lib/libfnd.a -lsql10

      -lclntsh  `cat /oracle/apps/tech_st/10.1.2/lib/ldflags`   

      -lnsslb10 -lncrypt10 -lnsgr10 -lnzjs10 -ln10 -lnnz10 -lnl10 -lnro10 `cat

      /oracle/apps/tech_st/10.1.2/lib/ldflags`    -lnsslb10

      -lncrypt10 -lnsgr10 -lnzjs10 -ln10 -lnnz10 -lnl10 -lclient10 -lnnetd10

      -lvsn10 -lcommon10 -lgeneric10 -lmm  -lcore10 -lxml10 -lunls10 -lsnls10

      -lnls10 -lcore10 -lnls10 `cat

      /oracle/apps/tech_st/10.1.2/lib/ldflags`    -lnsslb10

      -lncrypt10 -lnsgr10 -lnzjs10 -ln10 -lnnz10 -lnl10 -lnro10 `cat

      /oracle/apps/tech_st/10.1.2/lib/ldflags`    -lnsslb10

      -lncrypt10 -lnsgr10 -lnzjs10 -ln10 -lnnz10 -lnl10 -lclient10 -lnnetd10

      -lvsn10 -lcommon10 -lgeneric10    -lcore10 -lxml10 -lunls10 -lsnls10 -lnls10

      -lcore10 -lnls10 -lclient10 -lnnetd10  -lvsn10 -lcommon10 -lgeneric10 

      -lcore10 -lxml10 -lunls10 -lsnls10 -lnls10 -lcore10 -lnls10   `cat

      /oracle/apps/tech_st/10.1.2/lib/sysliblist` -ldl -lm  -lpthread

      /usr/lib/gcc/x86_64-redhat-linux/4.4.7/32/libgcc_s.so: undefined reference to

      `__stack_chk_fail@GLIBC_2.4'

      collect2: ld returned 1 exit status

      make: *** [/oracle/apps/apps_st/appl/ad/12.0.0/bin/adadminnew]

      Error 1

      Done with link of ad executable 'adadmin' on Mon Aug 12 21:30:25 WAT 2013

       

      Relink of module "adadmin" failed.

      See error messages above (also recorded in log file) for possible

      reasons for the failure.  Also, please check that the Unix userid

      running adrelink has read, write, and execute permissions

      on the directory /oracle/apps/apps_st/appl/ad/12.0.0/bin,

      and that there is sufficient space remaining on the disk partition

      containing your Oracle Applications installation.

       

      Relinking module 'adadmin_wrapper' in product ad ...

       

      make -f

      /oracle/apps/apps_st/appl/admin/CDV1EBS1/out/link_ad_21732.mk

      /oracle/apps/apps_st/appl/ad/12.0.0/bin/adadmin_wrapper

       

      Starting  link of ad executable 'adadmin_wrapper' on Mon Aug 12 21:30:25 WAT

      2013

      gcc -m32 -s -L/oracle/apps/tech_st/10.1.2/lib/stubs

      -L/oracle/apps/tech_st/10.1.2/lib -ldl -o

      /oracle/apps/apps_st/appl/ad/12.0.0/bin/adadmin_wrapper.new \

              /oracle/apps/apps_st/appl/ad/12.0.0/lib/adadmin_main.o

      -lsql10 -lclntsh  `cat /oracle/apps/tech_st/10.1.2/lib/ldflags`

         -lnsslb10 -lncrypt10 -lnsgr10 -lnzjs10 -ln10 -lnnz10 -lnl10 -lnro10 `cat

      /oracle/apps/tech_st/10.1.2/lib/ldflags`    -lnsslb10

      -lncrypt10 -lnsgr10 -lnzjs10 -ln10 -lnnz10 -lnl10 -lclient10 -lnnetd10

      -lvsn10 -lcommon10 -lgeneric10 -lmm  -lcore10 -lxml10 -lunls10 -lsnls10

      -lnls10 -lcore10 -lnls10 `cat

      /oracle/apps/tech_st/10.1.2/lib/ldflags`    -lnsslb10

      -lncrypt10 -lnsgr10 -lnzjs10 -ln10 -lnnz10 -lnl10 -lnro10 `cat

      /oracle/apps/tech_st/10.1.2/lib/ldflags`    -lnsslb10

      -lncrypt10 -lnsgr10 -lnzjs10 -ln10 -lnnz10 -lnl10 -lclient10 -lnnetd10

      -lvsn10 -lcommon10 -lgeneric10    -lcore10 -lxml10 -lunls10 -lsnls10 -lnls10

      -lcore10 -lnls10 -lclient10 -lnnetd10  -lvsn10 -lcommon10 -lgeneric10 

      -lcore10 -lxml10 -lunls10 -lsnls10 -lnls10 -lcore10 -lnls10   `cat

      /oracle/apps/tech_st/10.1.2/lib/sysliblist` -ldl -lm  -lpthread

      /usr/lib/gcc/x86_64-redhat-linux/4.4.7/32/libgcc_s.so: undefined reference to

      `__stack_chk_fail@GLIBC_2.4'

      collect2: ld returned 1 exit status

      make: ***

      [/oracle/apps/apps_st/appl/ad/12.0.0/bin/adadmin_wrapper] Error

      1

      Done with link of ad executable 'adadmin_wrapper' on Mon Aug 12 21:30:25 WAT

      2013

       

      Relink of module "adadmin_wrapper" failed.

      See error messages above (also recorded in log file) for possible

      reasons for the failure.  Also, please check that the Unix userid

      running adrelink has read, write, and execute permissions

      on the directory /oracle/apps/apps_st/appl/ad/12.0.0/bin,

      and that there is sufficient space remaining on the disk partition

      containing your Oracle Applications installation.

       

      Relinking module 'adaimgr' in product ad ...

       

      make -f

      /oracle/apps/apps_st/appl/admin/CDV1EBS1/out/link_ad_21754.mk

      /oracle/apps/apps_st/appl/ad/12.0.0/bin/adaimgr

       

      Starting  link of ad executable 'adaimgr' on Mon Aug 12 21:30:25 WAT 2013

      gcc -m32 -s -L/oracle/apps/tech_st/10.1.2/lib/stubs

      -L/oracle/apps/tech_st/10.1.2/lib -ldl  -o

      /oracle/apps/apps_st/appl/ad/12.0.0/bin/adaimgr.new

      /oracle/apps/apps_st/appl/ad/12.0.0/lib/aimain.o \

                                      /oracle/apps/apps_st/appl/ad/12.0.0/lib/libad.a

      /oracle/apps/apps_st/appl/fnd/12.0.0/lib/libfnd.a -lsql10

      -lclntsh  `cat /oracle/apps/tech_st/10.1.2/lib/ldflags`   

      -lnsslb10 -lncrypt10 -lnsgr10 -lnzjs10 -ln10 -lnnz10 -lnl10 -lnro10 `cat

      /oracle/apps/tech_st/10.1.2/lib/ldflags`    -lnsslb10

      -lncrypt10 -lnsgr10 -lnzjs10 -ln10 -lnnz10 -lnl10 -lclient10 -lnnetd10

      -lvsn10 -lcommon10 -lgeneric10 -lmm  -lcore10 -lxml10 -lunls10 -lsnls10

      -lnls10 -lcore10 -lnls10 `cat

      /oracle/apps/tech_st/10.1.2/lib/ldflags`    -lnsslb10

      -lncrypt10 -lnsgr10 -lnzjs10 -ln10 -lnnz10 -lnl10 -lnro10 `cat

      /oracle/apps/tech_st/10.1.2/lib/ldflags`    -lnsslb10

      -lncrypt10 -lnsgr10 -lnzjs10 -ln10 -lnnz10 -lnl10 -lclient10 -lnnetd10

      -lvsn10 -lcommon10 -lgeneric10    -lcore10 -lxml10 -lunls10 -lsnls10 -lnls10

      -lcore10 -lnls10 -lclient10 -lnnetd10  -lvsn10 -lcommon10 -lgeneric10 

      -lcore10 -lxml10 -lunls10 -lsnls10 -lnls10 -lcore10 -lnls10   `cat

      /oracle/apps/tech_st/10.1.2/lib/sysliblist` -ldl -lm  -lpthread

      /usr/lib/gcc/x86_64-redhat-linux/4.4.7/32/libgcc_s.so: undefined reference to

      `__stack_chk_fail@GLIBC_2.4'

      collect2: ld returned 1 exit status

      make: *** [/oracle/apps/apps_st/appl/ad/12.0.0/bin/adaimgr]

      Error 1

      Done with link of ad executable 'adaimgr' on Mon Aug 12 21:30:25 WAT 2013

       

      Relink of module "adaimgr" failed.

      See error messages above (also recorded in log file) for possible

      reasons for the failure.  Also, please check that the Unix userid

      running adrelink has read, write, and execute permissions

      on the directory /oracle/apps/apps_st/appl/ad/12.0.0/bin,

      and that there is sufficient space remaining on the disk partition

      containing your Oracle Applications installation.

       

      Relinking module 'adchkdig' in product ad ...

       

      make -f

      /oracle/apps/apps_st/appl/admin/CDV1EBS1/out/link_ad_21776.mk

      /oracle/apps/apps_st/appl/ad/12.0.0/bin/adchkdig

       

      Starting  link of ad executable 'adchkdig' on Mon Aug 12 21:30:25 WAT 2013

      gcc -m32 -s -L/oracle/apps/tech_st/10.1.2/lib/stubs

      -L/oracle/apps/tech_st/10.1.2/lib -ldl -o

      /oracle/apps/apps_st/appl/ad/12.0.0/bin/adchkdig

      /oracle/apps/apps_st/appl/ad/12.0.0/lib/adchkdig.o \

                                      /oracle/apps/apps_st/appl/ad/12.0.0/lib/libad.a

      /oracle/apps/apps_st/appl/fnd/12.0.0/lib/libfnd.a -lsql10

      -lclntsh  `cat /oracle/apps/tech_st/10.1.2/lib/ldflags`   

      -lnsslb10 -lncrypt10 -lnsgr10 -lnzjs10 -ln10 -lnnz10 -lnl10 -lnro10 `cat

      /oracle/apps/tech_st/10.1.2/lib/ldflags`    -lnsslb10

      -lncrypt10 -lnsgr10 -lnzjs10 -ln10 -lnnz10 -lnl10 -lclient10 -lnnetd10

      -lvsn10 -lcommon10 -lgeneric10 -lmm  -lcore10 -lxml10 -lunls10 -lsnls10

      -lnls10 -lcore10 -lnls10 `cat

      /oracle/apps/tech_st/10.1.2/lib/ldflags`    -lnsslb10

      -lncrypt10 -lnsgr10 -lnzjs10 -ln10 -lnnz10 -lnl10 -lnro10 `cat

      /oracle/apps/tech_st/10.1.2/lib/ldflags`    -lnsslb10

      -lncrypt10 -lnsgr10 -lnzjs10 -ln10 -lnnz10 -lnl10 -lclient10 -lnnetd10

      -lvsn10 -lcommon10 -lgeneric10    -lcore10 -lxml10 -lunls10 -lsnls10 -lnls10

      -lcore10 -lnls10 -lclient10 -lnnetd10  -lvsn10 -lcommon10 -lgeneric10 

      -lcore10 -lxml10 -lunls10 -lsnls10 -lnls10 -lcore10 -lnls10   `cat

      /oracle/apps/tech_st/10.1.2/lib/sysliblist` -ldl -lm  -lpthread

      /usr/lib/gcc/x86_64-redhat-linux/4.4.7/32/libgcc_s.so: undefined reference to

      `__stack_chk_fail@GLIBC_2.4'

      collect2: ld returned 1 exit status

      make: *** [/oracle/apps/apps_st/appl/ad/12.0.0/bin/adchkdig]

      Error 1

      Done with link of ad executable 'adchkdig' on Mon Aug 12 21:30:25 WAT 2013

       

      Relink of module "adchkdig" failed.

      See error messages above (also recorded in log file) for possible

      reasons for the failure.  Also, please check that the Unix userid

      running adrelink has read, write, and execute permissions

      on the directory /oracle/apps/apps_st/appl/ad/12.0.0/bin,

      and that there is sufficient space remaining on the disk partition

      containing your Oracle Applications installation.

       

      Relinking module 'adctrl' in product ad ...

       

      make -f

      /oracle/apps/apps_st/appl/admin/CDV1EBS1/out/link_ad_21798.mk

      /oracle/apps/apps_st/appl/ad/12.0.0/bin/adctrl

       

      Starting  link of ad executable 'adctrl' on Mon Aug 12 21:30:25 WAT 2013

      gcc -m32 -s -L/oracle/apps/tech_st/10.1.2/lib/stubs

      -L/oracle/apps/tech_st/10.1.2/lib -ldl -o

      /oracle/apps/apps_st/appl/ad/12.0.0/bin/adctrl.new \

                     

      /oracle/apps/apps_st/appl/ad/12.0.0/lib/aictrl.o \

                                      /oracle/apps/apps_st/appl/ad/12.0.0/lib/libad.a

      /oracle/apps/apps_st/appl/fnd/12.0.0/lib/libfnd.a -lsql10

      -lclntsh  `cat /oracle/apps/tech_st/10.1.2/lib/ldflags`   

      -lnsslb10 -lncrypt10 -lnsgr10 -lnzjs10 -ln10 -lnnz10 -lnl10 -lnro10 `cat

      /oracle/apps/tech_st/10.1.2/lib/ldflags`    -lnsslb10

      -lncrypt10 -lnsgr10 -lnzjs10 -ln10 -lnnz10 -lnl10 -lclient10 -lnnetd10

      -lvsn10 -lcommon10 -lgeneric10 -lmm  -lcore10 -lxml10 -lunls10 -lsnls10

      -lnls10 -lcore10 -lnls10 `cat

      /oracle/apps/tech_st/10.1.2/lib/ldflags`    -lnsslb10

      -lncrypt10 -lnsgr10 -lnzjs10 -ln10 -lnnz10 -lnl10 -lnro10 `cat

      /oracle/apps/tech_st/10.1.2/lib/ldflags`    -lnsslb10

      -lncrypt10 -lnsgr10 -lnzjs10 -ln10 -lnnz10 -lnl10 -lclient10 -lnnetd10

      -lvsn10 -lcommon10 -lgeneric10    -lcore10 -lxml10 -lunls10 -lsnls10 -lnls10

      -lcore10 -lnls10 -lclient10 -lnnetd10  -lvsn10 -lcommon10 -lgeneric10 

      -lcore10 -lxml10 -lunls10 -lsnls10 -lnls10 -lcore10 -lnls10   `cat

      /oracle/apps/tech_st/10.1.2/lib/sysliblist` -ldl -lm  -lpthread

      /usr/lib/gcc/x86_64-redhat-linux/4.4.7/32/libgcc_s.so: undefined reference to

      `__stack_chk_fail@GLIBC_2.4'

      collect2: ld returned 1 exit status

      make: *** [/oracle/apps/apps_st/appl/ad/12.0.0/bin/adctrlnew]

      Error 1

      Done with link of ad executable 'adctrl' on Mon Aug 12 21:30:25 WAT 2013

       

      Relink of module "adctrl" failed.

      See error messages above (also recorded in log file) for possible

      reasons for the failure.  Also, please check that the Unix userid

      running adrelink has read, write, and execute permissions

      on the directory /oracle/apps/apps_st/appl/ad/12.0.0/bin,

      and that there is sufficient space remaining on the disk partition

      containing your Oracle Applications installation.

       

      Relinking module 'adctrl_wrapper' in product ad ...

       

      make -f

      /oracle/apps/apps_st/appl/admin/CDV1EBS1/out/link_ad_21820.mk

      /oracle/apps/apps_st/appl/ad/12.0.0/bin/adctrl_wrapper

       

      Starting  link of ad executable 'adctrl_wrapper' on Mon Aug 12 21:30:25 WAT

      2013

      gcc -m32 -s -L/oracle/apps/tech_st/10.1.2/lib/stubs

      -L/oracle/apps/tech_st/10.1.2/lib -ldl -o

      /oracle/apps/apps_st/appl/ad/12.0.0/bin/adctrl_wrapper.new \

              /oracle/apps/apps_st/appl/ad/12.0.0/lib/adctrl_main.o

      -lsql10 -lclntsh  `cat /oracle/apps/tech_st/10.1.2/lib/ldflags`

         -lnsslb10 -lncrypt10 -lnsgr10 -lnzjs10 -ln10 -lnnz10 -lnl10 -lnro10 `cat

      /oracle/apps/tech_st/10.1.2/lib/ldflags`    -lnsslb10

      -lncrypt10 -lnsgr10 -lnzjs10 -ln10 -lnnz10 -lnl10 -lclient10 -lnnetd10

      -lvsn10 -lcommon10 -lgeneric10 -lmm  -lcore10 -lxml10 -lunls10 -lsnls10

      -lnls10 -lcore10 -lnls10 `cat

      /oracle/apps/tech_st/10.1.2/lib/ldflags`    -lnsslb10

      -lncrypt10 -lnsgr10 -lnzjs10 -ln10 -lnnz10 -lnl10 -lnro10 `cat

      /oracle/apps/tech_st/10.1.2/lib/ldflags`    -lnsslb10

      -lncrypt10 -lnsgr10 -lnzjs10 -ln10 -lnnz10 -lnl10 -lclient10 -lnnetd10

      -lvsn10 -lcommon10 -lgeneric10    -lcore10 -lxml10 -lunls10 -lsnls10 -lnls10

      -lcore10 -lnls10 -lclient10 -lnnetd10  -lvsn10 -lcommon10 -lgeneric10 

      -lcore10 -lxml10 -lunls10 -lsnls10 -lnls10 -lcore10 -lnls10   `cat

      /oracle/apps/tech_st/10.1.2/lib/sysliblist` -ldl -lm  -lpthread

      /usr/lib/gcc/x86_64-redhat-linux/4.4.7/32/libgcc_s.so: undefined reference to

      `__stack_chk_fail@GLIBC_2.4'

      collect2: ld returned 1 exit status

      make: ***

      [/oracle/apps/apps_st/appl/ad/12.0.0/bin/adctrl_wrapper] Error 1

      Done with link of ad executable 'adctrl_wrapper' on Mon Aug 12 21:30:26 WAT

      2013

       

      Relink of module "adctrl_wrapper" failed.

      See error messages above (also recorded in log file) for possible

      reasons for the failure.  Also, please check that the Unix userid

      running adrelink has read, write, and execute permissions

      on the directory /oracle/apps/apps_st/appl/ad/12.0.0/bin,

      and that there is sufficient space remaining on the disk partition

      containing your Oracle Applications installation.

       

      Relinking module 'addefgen' in product ad ...

       

      make -f

      /oracle/apps/apps_st/appl/admin/CDV1EBS1/out/link_ad_21842.mk

      /oracle/apps/apps_st/appl/ad/12.0.0/bin/addefgen

       

      Starting  link of ad executable 'addefgen' on Mon Aug 12 21:30:26 WAT 2013

      gcc -m32 -s -L/oracle/apps/tech_st/10.1.2/lib/stubs

      -L/oracle/apps/tech_st/10.1.2/lib -ldl -o

      /oracle/apps/apps_st/appl/ad/12.0.0/bin/addefgen \

                      /oracle/apps/apps_st/appl/ad/12.0.0/lib/addefgen.o \

                      /oracle/apps/apps_st/appl/ad/12.0.0/lib/libad.a

      /oracle/apps/apps_st/appl/fnd/12.0.0/lib/libfnd.a -lsql10

      -lclntsh  `cat /oracle/apps/tech_st/10.1.2/lib/ldflags`   

      -lnsslb10 -lncrypt10 -lnsgr10 -lnzjs10 -ln10 -lnnz10 -lnl10 -lnro10 `cat

      /oracle/apps/tech_st/10.1.2/lib/ldflags`    -lnsslb10

      -lncrypt10 -lnsgr10 -lnzjs10 -ln10 -lnnz10 -lnl10 -lclient10 -lnnetd10

      -lvsn10 -lcommon10 -lgeneric10 -lmm  -lcore10 -lxml10 -lunls10 -lsnls10

      -lnls10 -lcore10 -lnls10 `cat

      /oracle/apps/tech_st/10.1.2/lib/ldflags`    -lnsslb10

      -lncrypt10 -lnsgr10 -lnzjs10 -ln10 -lnnz10 -lnl10 -lnro10 `cat

      /oracle/apps/tech_st/10.1.2/lib/ldflags`    -lnsslb10

      -lncrypt10 -lnsgr10 -lnzjs10 -ln10 -lnnz10 -lnl10 -lclient10 -lnnetd10

      -lvsn10 -lcommon10 -lgeneric10    -lcore10 -lxml10 -lunls10 -lsnls10 -lnls10

      -lcore10 -lnls10 -lclient10 -lnnetd10  -lvsn10 -lcommon10 -lgeneric10 

      -lcore10 -lxml10 -lunls10 -lsnls10 -lnls10 -lcore10 -lnls10   `cat

      /oracle/apps/tech_st/10.1.2/lib/sysliblist` -ldl -lm  -lpthread

      /usr/lib/gcc/x86_64-redhat-linux/4.4.7/32/libgcc_s.so: undefined reference to

      `__stack_chk_fail@GLIBC_2.4'

      collect2: ld returned 1 exit status

      make: *** [/oracle/apps/apps_st/appl/ad/12.0.0/bin/addefgen]

      Error 1

      Done with link of ad executable 'addefgen' on Mon Aug 12 21:30:26 WAT 2013

       

      Relink of module "addefgen" failed.

      See error messages above (also recorded in log file) for possible

      reasons for the failure.  Also, please check that the Unix userid

      running adrelink has read, write, and execute permissions

      on the directory /oracle/apps/apps_st/appl/ad/12.0.0/bin,

      and that there is sufficient space remaining on the disk partition

      containing your Oracle Applications installation.

       

      Relinking module 'addmimp' in product ad ...

       

      make -f

      /oracle/apps/apps_st/appl/admin/CDV1EBS1/out/link_ad_21864.mk

      /oracle/apps/apps_st/appl/ad/12.0.0/bin/addmimp

       

      Starting  link of ad executable 'addmimp' on Mon Aug 12 21:30:26 WAT 2013

      gcc -m32 -s -L/oracle/apps/tech_st/10.1.2/lib/stubs

      -L/oracle/apps/tech_st/10.1.2/lib -ldl -o

      /oracle/apps/apps_st/appl/ad/12.0.0/bin/addmimp

      /oracle/apps/apps_st/appl/ad/12.0.0/lib/dmmmain.o \

                                      /oracle/apps/apps_st/appl/ad/12.0.0/lib/libad.a

      /oracle/apps/apps_st/appl/fnd/12.0.0/lib/libfnd.a -lsql10

      -lclntsh  `cat /oracle/apps/tech_st/10.1.2/lib/ldflags`   

      -lnsslb10 -lncrypt10 -lnsgr10 -lnzjs10 -ln10 -lnnz10 -lnl10 -lnro10 `cat

      /oracle/apps/tech_st/10.1.2/lib/ldflags`    -lnsslb10

      -lncrypt10 -lnsgr10 -lnzjs10 -ln10 -lnnz10 -lnl10 -lclient10 -lnnetd10

      -lvsn10 -lcommon10 -lgeneric10 -lmm  -lcore10 -lxml10 -lunls10 -lsnls10

      -lnls10 -lcore10 -lnls10 `cat

      /oracle/apps/tech_st/10.1.2/lib/ldflags`    -lnsslb10

      -lncrypt10 -lnsgr10 -lnzjs10 -ln10 -lnnz10 -lnl10 -lnro10 `cat

      /oracle/apps/tech_st/10.1.2/lib/ldflags`    -lnsslb10

      -lncrypt10 -lnsgr10 -lnzjs10 -ln10 -lnnz10 -lnl10 -lclient10 -lnnetd10

      -lvsn10 -lcommon10 -lgeneric10    -lcore10 -lxml10 -lunls10 -lsnls10 -lnls10

      -lcore10 -lnls10 -lclient10 -lnnetd10  -lvsn10 -lcommon10 -lgeneric10 

      -lcore10 -lxml10 -lunls10 -lsnls10 -lnls10 -lcore10 -lnls10   `cat

      /oracle/apps/tech_st/10.1.2/lib/sysliblist` -ldl -lm  -lpthread

      /usr/lib/gcc/x86_64-redhat-linux/4.4.7/32/libgcc_s.so: undefined reference to

      `__stack_chk_fail@GLIBC_2.4'

      collect2: ld returned 1 exit status

      make: *** [/oracle/apps/apps_st/appl/ad/12.0.0/bin/addmimp]

      Error 1

      Done with link of ad executable 'addmimp' on Mon Aug 12 21:30:26 WAT 2013

       

      Relink of module "addmimp" failed.

      See error messages above (also recorded in log file) for possible

      reasons for the failure.  Also, please check that the Unix userid

      running adrelink has read, write, and execute permissions

      on the directory /oracle/apps/apps_st/appl/ad/12.0.0/bin,

      and that there is sufficient space remaining on the disk partition

      containing your Oracle Applications installation.

       

      Relinking module 'adgenhnm' in product ad ...

       

      make -f

      /oracle/apps/apps_st/appl/admin/CDV1EBS1/out/link_ad_21886.mk

      /oracle/apps/apps_st/appl/ad/12.0.0/bin/adgenhnm

       

      Starting  link of ad executable 'adgenhnm' on Mon Aug 12 21:30:26 WAT 2013

      gcc -m32 -s -L/oracle/apps/tech_st/10.1.2/lib/stubs

      -L/oracle/apps/tech_st/10.1.2/lib -ldl -o

      /oracle/apps/apps_st/appl/ad/12.0.0/bin/adgenhnm \

                      /oracle/apps/apps_st/appl/ad/12.0.0/lib/adgenhomenum.o \

                      /oracle/apps/apps_st/appl/ad/12.0.0/lib/libad.a

      /oracle/apps/apps_st/appl/fnd/12.0.0/lib/libfnd.a -lsql10

      -lclntsh  `cat /oracle/apps/tech_st/10.1.2/lib/ldflags`   

      -lnsslb10 -lncrypt10 -lnsgr10 -lnzjs10 -ln10 -lnnz10 -lnl10 -lnro10 `cat

      /oracle/apps/tech_st/10.1.2/lib/ldflags`    -lnsslb10

      -lncrypt10 -lnsgr10 -lnzjs10 -ln10 -lnnz10 -lnl10 -lclient10 -lnnetd10

      -lvsn10 -lcommon10 -lgeneric10 -lmm  -lcore10 -lxml10 -lunls10 -lsnls10

      -lnls10 -lcore10 -lnls10 `cat

      /oracle/apps/tech_st/10.1.2/lib/ldflags`    -lnsslb10

      -lncrypt10 -lnsgr10 -lnzjs10 -ln10 -lnnz10 -lnl10 -lnro10 `cat

      /oracle/apps/tech_st/10.1.2/lib/ldflags`    -lnsslb10

      -lncrypt10 -lnsgr10 -lnzjs10 -ln10 -lnnz10 -lnl10 -lclient10 -lnnetd10

      -lvsn10 -lcommon10 -lgeneric10    -lcore10 -lxml10 -lunls10 -lsnls10 -lnls10

      -lcore10 -lnls10 -lclient10 -lnnetd10  -lvsn10 -lcommon10 -lgeneric10 

      -lcore10 -lxml10 -lunls10 -lsnls10 -lnls10 -lcore10 -lnls10   `cat

      /oracle/apps/tech_st/10.1.2/lib/sysliblist` -ldl -lm  -lpthread

      /usr/lib/gcc/x86_64-redhat-linux/4.4.7/32/libgcc_s.so: undefined reference to

      `__stack_chk_fail@GLIBC_2.4'

      collect2: ld returned 1 exit status

      make: *** [/oracle/apps/apps_st/appl/ad/12.0.0/bin/adgenhnm]

      Error 1

      Done with link of ad executable 'adgenhnm' on Mon Aug 12 21:30:26 WAT 2013

       

      Relink of module "adgenhnm" failed.

      See error messages above (also recorded in log file) for possible

      reasons for the failure.  Also, please check that the Unix userid

      running adrelink has read, write, and execute permissions

      on the directory /oracle/apps/apps_st/appl/ad/12.0.0/bin,

      and that there is sufficient space remaining on the disk partition

      containing your Oracle Applications installation.

       

       

      Regards

      Minhaj

        • 1. Re: Relink of module "adadmin" failed.
          Hussein Sawwan-Oracle

          /usr/lib/gcc/x86_64-redhat-linux/4.4.7/32/libgcc_s.so: undefined reference to`__stack_chk_fail@GLIBC_2.4'


          Please see (Relink From Adadmin Giving Error: libgcc_s.so: undefined reference to `__stack_chk_fail@GLIBC_2.4' (Doc ID 1525823.1)).


          Thanks,

          Hussein

          • 2. Re: Relink of module "adadmin" failed.
            Mohammed Abdul Muqeet

            Hussein,

             

            After following the action plan i am getting the below error.

             

            /u01/applmgr/SID/apps/tech_st/10.1.2/lib/stubs

             

            Error while executing the below script.

             

            $ORACLE_HOME/appsutil/clone/adlnktools.

             

            Error while running adlnktools.sh.

              return code = .10.11.13.14.15.16.39.43.45.46.46.47.48.49

            Please check logfile located at /u01/inst/apps/SID/logs/ora/10.1.2/install/make_08130044.log

             

            vi /u01/applmgr/SID/inst/apps/SID_HOSTNAME/logs/ora/10.1.2/install/make_08130044.log

            /usr/lib/gcc/x86_64-redhat-linux/4.4.7/32/libgcc_s.so: undefined reference to `__stack_chk_fail@GLIBC_2.4'

            collect2: ld returned 1 exit status

            make: *** [/u01/applmgr/SID/apps/tech_st/10.1.2/rdbms/lib/imp] Error 1

            Failed linking target iimp  on Tue Aug 13 00:44:51 WAT 2013...

            /u01/applmgr/SID/apps/tech_st/10.1.2/rdbms/lib

             

            Could you please advise.

             

            regards

            Minhaj

            • 3. Re: Relink of module "adadmin" failed.
              Hussein Sawwan-Oracle

              What's the action plan you followed? Was the patch installed? Did you run the ln commands after copying the files from the patch and run adlnktools.sh script?

               

              Thanks,

              Hussein

              • 4. Re: Relink of module "adadmin" failed.
                ;) ApPsMasTi ;)

                Please upload the last log files

                please see the below doc

                please let us know which document you are following and at what step you are facing relinking error

                 

                Relink Reports After Applying Any Patch, Getting Errors: collect2: ld returned 1 exit status, make: *** [rwbuilder] Error 1 (Doc ID 1218994.1)

                After Cloning Adrelink Fails With Error tech_st/10.1.2/lib/stubs/libc.so.6 collect2: ld returned 1 exit status (Doc ID 1275418.1)

                make -f ins_forms.mk sharedlib install is failing with /usr/bin/ld: cannot find -lhpi collect2: ld returned 1 exit status make: *** [frmbld] Error 1 (Doc ID 1529324.1)


                AppsmAsTi

                Sharing is Caring