6 Replies Latest reply: Jan 8, 2014 6:07 AM by vivi RSS

Oracle 12c installation failed in Ubuntu 13.10

vivi Newbie
Currently Being Moderated

I understand that Ubuntu is not supported platform for installing Oracle rdbms's. Managed to install the earlier versions in it.

 

OS & GCC version:

vivek@vivek-idc:~/Documents/Oracle12c/1201/bin$ cat /proc/version

Linux version 3.11.0-12-generic (buildd@allspice) (gcc version 4.8.1 (Ubuntu/Linaro 4.8.1-10ubuntu7) ) #19-Ubuntu SMP Wed Oct 9 16:20:46 UTC 2013

 

Iam trying to install Oracle 12c on Ubuntu 13.10 and getting the below error:

 

make -f /home/vivek/Documents/Oracle12c/1201/precomp/lib/ins_precomp.mk relink EXENAME=proc

make[1]: Entering directory `/home/vivek/Documents/Oracle12c/1201/precomp/lib'

Linking /home/vivek/Documents/Oracle12c/1201/precomp/lib/proc

 

 

INFO: /usr/bin/ld: /home/vivek/Documents/Oracle12c/1201/lib//libnls12.a(lxhlang.o): undefined reference to symbol '__tls_get_addr@@GLIBC_2.3'

/lib/x86_64-linux-gnu/ld-linux-x86-64.so.2: error adding symbols: DSO missing from command line

collect2: error: ld returned 1 exit status

 

 

INFO: /bin/chmod: cannot access ‘/home/vivek/Documents/Oracle12c/1201/precomp/lib/proc’: No such file or directory

 

 

INFO: make[1]: *** [/home/vivek/Documents/Oracle12c/1201/precomp/lib/proc] Error 1

 

 

INFO: make[1]: Leaving directory `/home/vivek/Documents/Oracle12c/1201/precomp/lib'

 

 

INFO: make: *** [proc] Error 2

 

 

INFO: End output from spawned process.

INFO: ----------------------------------

INFO: Exception thrown from action: make

Exception Name: MakefileException

Exception String: Error in invoking target 'links proc gen_pcscfg procob' of makefile '/home/vivek/Documents/Oracle12c/1201/precomp/lib/ins_precomp.mk'. See '/home/vivek/oraInventory/logs/installActions2013-10-24_08-18-59PM.log' for details.

Exception Severity: 1

 

 

Any ideas on this is appreciated.

Legend

  • Correct Answers - 10 points
  • Helpful Answers - 5 points