0 Replies Latest reply on Apr 15, 2014 6:56 PM by 380288f9-7f88-44ae-bb5e-10c861cf2917

    Error Building WebLogicFusionOrderDemo Application

    380288f9-7f88-44ae-bb5e-10c861cf2917

      Hi, deploying WebLogicFusionOrderDemo application I get this error running build.xml  [java] Exception in thread "main" oracle.fabric.common.FabricException: Error enqueueing event: ORA-06576: not a valid function or procedure name     [java]    [java] at oracle.integration.platform.blocks.event.saq.SAQRemoteBusinessEventConnection.enqueueEvent(SAQRemoteBusinessEventConnection.java:87)    [java] at oracle.integration.platform.blocks.event.saq.SAQRemoteBusinessEventConnection.publishEvent(SAQRemoteBusinessEventConnection.java:56)    [java] at oracle.integration.platform.blocks.event.SendEvent.main(SendEvent.java:83)    [java] Caused by: java.sql.SQLException: ORA-06576: not a valid function or procedure name    [java]    [java] at oracle.jdbc.driver.T4CTTIoer.processError(T4CTTIoer.java:440)    [java] at oracle.jdbc.driver.T4CTTIoer.processError(T4CTTIoer.java:396)    [java] at oracle.jdbc.driver.T4C8Oall.processError(T4C8Oall.java:837)    [java] at oracle.jdbc.driver.T4CTTIfun.receive(T4CTTIfun.java:445)    [java] at oracle.jdbc.driver.T4CTTIfun.doRPC(T4CTTIfun.java:191)    [java] at oracle.jdbc.driver.T4C8Oall.doOALL(T4C8Oall.java:523)    [java] at oracle.jdbc.driver.T4CCallableStatement.doOall8(T4CCallableStatement.java:204)    [java] at oracle.jdbc.driver.T4CCallableStatement.executeForRows(T4CCallableStatement.java:1006)    [java] at oracle.jdbc.driver.OracleStatement.doExecuteWithTimeout(OracleStatement.java:1315)    [java] at oracle.jdbc.driver.OraclePreparedStatement.executeInternal(OraclePreparedStatement.java:3576)    [java] at oracle.jdbc.driver.OraclePreparedStatement.execute(OraclePreparedStatement.java:3677)    [java] at oracle.jdbc.driver.OracleCallableStatement.execute(OracleCallableStatement.java:4714)    [java] at oracle.jdbc.driver.OraclePreparedStatementWrapper.execute(OraclePreparedStatementWrapper.java:1374)    [java] at oracle.integration.platform.blocks.event.saq.SAQRemoteBusinessEventConnection.enqueueEvent(SAQRemoteBusinessEventConnection.java:81)    [java] ... 2 moreBUILD FAILEDC:\Ebooks\IT\Oracle\SOA\Oracle SOA Suite - Developer\FusionOrderDemo_R1PS6\CompositeServices\bin\build.xml:321: The following error occurred while executing this line:C:\Ebooks\IT\Oracle\SOA\Oracle SOA Suite - Developer\FusionOrderDemo_R1PS6\CompositeServices\bin\build.xml:452: Java returned: 1Total time: 7 minutes 31 seconds