10 Replies Latest reply on Feb 8, 2015 3:55 PM by Jcgo-Oracle

    EBS Install error for 12.2

    Jcgo-Oracle

      Hi All,

      Got this error:

       

      ner Log File         /u01/oracle/VIS/11.2.0/admin/VIS_ebs/diag/tnslsnr/ebs/vis/alert/log.xml

      Listening Endpoints Summary...

        (DESCRIPTION=(ADDRESS=(PROTOCOL=tcp)(HOST=server)(PORT=1521)))

      Services Summary...

      Service "VIS" has 1 instance(s).

        Instance "VIS", status UNKNOWN, has 1 handler(s) for this service...

      The command completed successfully

       

      addlnctl.sh: exiting with status 0

       

      addlnctl.sh: check the logfile /u01/oracle/VIS/11.2.0/appsutil/log/VIS_ebs/addlnctl.txt for more information ... 

       

       

      modifying ebs_logon trigger:DISABLE

      InstallAppNode2:Please refer to the remaining logs on secondary applications node at - /u01/oracle/VIS/fs2/inst/apps/VIS_ebs/logs/02061816.log


      Here are some snippets: it failed at TXK session:

      Installing 10.1.2 Tools patches.

       

       

       

       

       

       

      Using /u01/oracle/VIS/fs2/inst/apps/VIS_ebs/temp/xmldocs/instToolPatches.xml

       

       

       

       

       

       

      Executing command: /u01/software/ebs/stage_R12/startCD/Disk1/rapidwiz/jre/Linux_x64/1.6.0/bin/java -cp /u01/oracle/VIS/fs2/inst/apps/VIS_ebs/temp/ASInstallHome/fnd/../j11067592_fnd.zip:/u01/oracle/VIS/fs2/inst/apps/VIS_ebs/temp/ASInstallHome/fnd/java/3rdparty/stdalone/xmlparserv2.zip -Doracle.apps.fnd.txk.env_home=/u01/oracle/VIS/fs2/EBSapps/appl/admin/VIS_ebs/ -Doracle.apps.fnd.txk.runtime.config=/u01/oracle/VIS/fs2/inst/apps/VIS_ebs/temp/xmldocs/instToolPatches.xml oracle.apps.fnd.txk.config.InstallService

       

       

      Fatal Error: TXK Install Service

       

       

      oracle.apps.fnd.txk.config.ProcessStateException: FileSys OS COMMAND Failed : Exit=2 See log for details. CMD= make -f ins_forms.mk sharedlib install ## Node=NodeId=1103 Type=24 TypeName=filesys_patch_action Name= RefId=457 State=init ConfigDoc=APPS_C_HOME ParentDoc=null Topology=R12 Action=os_cmd

       

       

          at oracle.apps.fnd.txk.config.FileSysPatchActionNode.doFileSysOSCmd(FileSysPatchActionNode.java:169)

       

       

      ************

       

      any way to restart or clean up and do the process of install again after clean up?





        • 1. Re: EBS Install error for 12.2
          Srini Chavali-Oracle

          What is the OS ? If AIX, see MOS Doc 1330703.1 - section titled "Rapid Install failure on NFS"

          • 2. Re: EBS Install error for 12.2
            Jcgo-Oracle

            OS is Linux 64 bit

            • 3. Re: EBS Install error for 12.2
              Hussein Sawwan-Oracle

              Please check the following log files for any details about the error.

               

              /u01/oracle/VIS/fs2/inst/apps/VIS_ebs/admin/log/ApplyAppsTechStack_02062027.log

              /u01/app/oraInventory/logs/installActions2015-02-06_06-52-20PM.log

               

              Complete set of logs can be found in (Troubleshooting Rapid Install for E-Business Suite Release 12.2 (Doc ID 1378579.1)).

               

              Thanks,

              Hussein

              • 4. Re: EBS Install error for 12.2
                Jcgo-Oracle

                dont see ANY errors...I need more direction on this please...thank you.

                 

                *************  apply tech stack log*

                 

                #############################################################

                Started ApplyAppsTechStack at Sat Feb 07 12:23:45 PST 2015

                Version:

                  ApplyAppsTechStack.java : 120.28

                #############################################################

                Skipping AutoConfig execution. AutoConfig will be run as a part of ApplyAppltop

                ApplyApplTechStack Completed Successfully.

                 

                **************

                 

                 

                 

                Installing 10.1.2 Tools patches.

                 

                 

                 

                 

                 

                 

                Using /u01/oracle/VIS/fs2/inst/apps/VIS_ebs/temp/xmldocs/instToolPatches.xml

                 

                 

                 

                 

                 

                 

                Executing command: /u01/software/ebs/stage_R12/startCD/Disk1/rapidwiz/jre/Linux_x64/1.6.0/bin/java -cp /u01/oracle/VIS/fs2/inst/apps/VIS_ebs/temp/ASInstallHome/fnd/../j11067592_fnd.zip:/u01/oracle/VIS/fs2/inst/apps/VIS_ebs/temp/ASInstallHome/fnd/java/3rdparty/stdalone/xmlparserv2.zip -Doracle.apps.fnd.txk.env_home=/u01/oracle/VIS/fs2/EBSapps/appl/admin/VIS_ebs/ -Doracle.apps.fnd.txk.runtime.config=/u01/oracle/VIS/fs2/inst/apps/VIS_ebs/temp/xmldocs/instToolPatches.xml oracle.apps.fnd.txk.config.InstallService

                 

                 

                Fatal Error: TXK Install Service

                 

                 

                oracle.apps.fnd.txk.config.ProcessStateException: FileSys OS COMMAND Failed : Exit=2 See log for details. CMD= make -f ins_forms.mk sharedlib install ## Node=NodeId=1103 Type=24 TypeName=filesys_patch_action Name= RefId=457 State=init ConfigDoc=APPS_C_HOME ParentDoc=null Topology=R12 Action=os_cmd

                 

                 

                    at oracle.apps.fnd.txk.config.FileSysPatchActionNode.doFileSysOSCmd(FileSysPatchActionNode.java:169)

                 

                 

                    at oracle.apps.fnd.txk.config.FileSysPatchActionNode.processState(FileSysPatchActionNode.java:101)

                 

                 

                    at oracle.apps.fnd.txk.config.PatchActionNode.processState(PatchActionNode.java:187)

                 

                 

                    at oracle.apps.fnd.txk.config.PatchNode.processState(PatchNode.java:338)

                 

                 

                    at oracle.apps.fnd.txk.config.PatchesNode.processState(PatchesNode.java:79)

                 

                 

                    at oracle.apps.fnd.txk.config.InstallNode.processState(InstallNode.java:68)

                 

                 

                    at oracle.apps.fnd.txk.config.TXKTopology.traverse(TXKTopology.java:594)

                 

                 

                    at oracle.apps.fnd.txk.config.InstallService.doInvoke(InstallService.java:224)

                 

                 

                    at oracle.apps.fnd.txk.config.InstallService.invoke(InstallService.java:237)

                 

                 

                    at oracle.apps.fnd.txk.config.InstallService.main(InstallService.java:291)

                 

                 

                 

                 

                 

                 

                Cannot patch 10.1.2 Tools.

                 

                 

                    RW-50010: Error: - script has returned an error:   1

                RW-50004: Error code received when running external process.  Check log file for details.

                Running APPL_TOP Install Driver for VIS instance

                 

                 

                ********

                • 5. Re: EBS Install error for 12.2
                  Jcgo-Oracle

                  keep seeing these:

                   

                  rm -f nnfgt.*

                  (if [ "compile" = "compile" ] ; then \

                     /u01/oracle/VIS/fs2/EBSapps/10.1.2/bin/gennfgt > nnfgt.c

                     /u01/oracle/VIS/fs2/EBSapps/10.1.2/bin/ogcc   -c nnfgt.c

                     rm -f /u01/oracle/VIS/fs2/EBSapps/10.1.2/lib/nnfgt.o

                     mv nnfgt.o /u01/oracle/VIS/fs2/EBSapps/10.1.2/lib/

                            /usr/bin/ar rv /u01/oracle/VIS/fs2/EBSapps/10.1.2/lib/libn10.a /u01/oracle/VIS/fs2/EBSapps/10.1.2/lib/nnfgt.o ; fi)

                  In file included from /usr/include/features.h:385,

                                   from /usr/include/sys/types.h:26,

                                   from nnfgt.c:7:

                  /usr/include/gnu/stubs.h:7:27: error: gnu/stubs-32.h: No such file or directory

                  mv: cannot stat `nnfgt.o': No such file or directory

                  /usr/bin/ar: /u01/oracle/VIS/fs2/EBSapps/10.1.2/lib/nnfgt.o: No such file or directory

                  make: *** [nnfgt.o] Error 1

                  Failed linking target nnfgt.o on Sat Feb  7 12:23:38 PST 2015...

                  /u01/oracle/VIS/fs2/EBSapps/10.1.2/network/lib

                  /u01/oracle/VIS/fs2/EBSapps/10.1.2/bin/genclntsh

                  /usr/bin/ld: crti.o: No such file: No such file or directory

                  collect2: ld returned 1 exit status

                  /u01/oracle/VIS/fs2/EBSapps/10.1.2/bin/genagtsh /u01/oracle/VIS/fs2/EBSapps/10.1.2/lib/libagtsh.so 1.0

                  /usr/bin/ld: crti.o: No such file: No such file or directory

                  collect2: ld returned 1 exit status

                  Completed linking target client_sharedlib on Sat Feb  7 12:23:38 PST 2015...

                  /u01/oracle/VIS/fs2/EBSapps/10.1.2/precomp/lib

                  (cd /u01/oracle/VIS/fs2/EBSapps/10.1.2/precomp/public ; rm -f SQLCA.H)

                  (cd /u01/oracle/VIS/fs2/EBSapps/10.1.2/precomp/public ; rm -f ORACA.H)

                  • 6. Re: EBS Install error for 12.2
                    Jcgo-Oracle

                    Error found while relinking

                      return code = .2.3.5.6.10.11.12.13.14.15.16.17.18.19.20.21.22.23.24.25.26.27.28.29.30.31.32.33.34.35.36.37.38.39.41.42.43.44.45.46.46.47.48.49

                     

                    make log file located at:

                     

                    /u01/oracle/VIS/fs2/inst/apps/VIS_ebs/logs/ora/10.1.2/install directory

                    • 7. Re: EBS Install error for 12.2
                      Jcgo-Oracle

                      i re-ran adlknktools.sh manually and i see " ntcontab.o" is missing:

                      adlnktools.sh started at Sat Feb  7 16:15:22 PST 2015

                      /u01/oracle/VIS/fs2/EBSapps/10.1.2/network/lib

                      Completed linking target mkldflags on Sat Feb  7 16:15:22 PST 2015...

                      /u01/oracle/VIS/fs2/EBSapps/10.1.2/network/lib

                      rm -f ntcontab.*

                      (if [ "compile" = "compile" ] ; then \

                         /u01/oracle/VIS/fs2/EBSapps/10.1.2/bin/gennttab > ntcontab.c

                         /u01/oracle/VIS/fs2/EBSapps/10.1.2/bin/ogcc   -c ntcontab.c

                         rm -f /u01/oracle/VIS/fs2/EBSapps/10.1.2/lib/ntcontab.o

                         mv ntcontab.o /u01/oracle/VIS/fs2/EBSapps/10.1.2/lib/

                                /usr/bin/ar rv /u01/oracle/VIS/fs2/EBSapps/10.1.2/lib/libn10.a /u01/oracle/VIS/fs2/EBSapps/10.1.2/lib/ntcontab.o ; fi)

                      In file included from /usr/include/features.h:385,

                                       from /usr/include/sys/types.h:26,

                                       from ntcontab.c:7:

                      /usr/include/gnu/stubs.h:7:27: error: gnu/stubs-32.h: No such file or directory

                      mv: cannot stat `ntcontab.o': No such file or directory

                      /usr/bin/ar: /u01/oracle/VIS/fs2/EBSapps/10.1.2/lib/ntcontab.o: No such file or directory

                      make: *** [ntcontab.o] Error 1

                      Failed linking target ntcontab.o on Sat Feb  7 16:15:22 PST 2015...

                      /u01/oracle/VIS/fs2/EBSapps/10.1.2/network/lib

                      rm -f nnfgt.*

                      (if [ "compile" = "compile" ] ; then \

                         /u01/oracle/VIS/fs2/EBSapps/10.1.2/bin/gennfgt > nnfgt.c

                      • 8. Re: EBS Install error for 12.2
                        ;) ApPsMasTi ;)

                        make sure you have all the OS  prerequisite packages

                        Oracle E-Business Suite Installation and Upgrade Notes Release 12 (12.2) for Linux x86-64 (Doc ID 1330701.1)

                         

                        please see solution of the below doc which is related to pre requisite package

                        Installation of the Grid Control Agent 10.2.0.4/5 on Linux x86_64 Fails: Error in invoking target 'ntcontab.o' of makefile (Doc ID 861347.1)

                         

                        AppsMasti

                        Sharing is Caring

                        1 person found this helpful
                        • 9. Re: EBS Install error for 12.2
                          yoonas

                          JCGO,

                           

                          As Appsmasti says, make sure you have completed all the pre-installation steps successfully. One of the main reasons of relinking error is missing packages/required package version.

                          You could also use pre-install rule sets to verify pre install rrequirements

                          RDA - Health Check / Validation Engine Guide (Doc ID 250262.1)

                           

                          Regards

                          Yoonas

                          1 person found this helpful
                          • 10. Re: EBS Install error for 12.2
                            Jcgo-Oracle

                            Thanks everyone. It was helpfuil to know all the log file locations and also the steps per configuration.

                            Instance is up and running now....