1 Reply Latest reply on Jun 21, 2016 6:09 AM by Thiagarajan -Oracle

    perl ojspCompile.pl --compile --flush (Failed in R12.2.3

    3203003

      Hi Friends,

       

      I have a challenge, Post clonning I am unable to see my Homepage. Thought of compilling my jsp.


      I have noticed the below error. can you please advise.

       

      Regards

      Mohammed

       

       

      Error.

      $ perl ojspCompile.pl --compile --flush

      /fs1/inst/apps/CONTEXT_NAME/logs/appl/rgf/ojsp/ojspc_error.log

      starting...(compiling all)

      using 10i internal ojsp ver: 10.3.6.0

      synchronizing dependency file:

        loading deplist...7864

        enumerating jsps...7864

        updating dependency...0

      initializing compilation:

        eliminating children...5991 (-1873)

      translating and compiling:

        translating jsps...5991/5991 in 9m21s

        compiling jsps...5991/5991 [failed: 1] in 9m11s

      Finished!

      ====================================================================================================

       

       

      translating and compiling:

      COMMAND: exec java weblogic.appc  -library '/fs1/FMW_Home/oracle_common/modules/oracle.uix_11.1.1/uix11.war,/fs1/FMW_Home/oracle_common/webcenter/modules/oracle.portlet.server_11.1.1/oracle.producer.wsrp.war,/fs1/FMW_Home/oracle_common/webcenter/modules/oracle.portlet.server_11.1.1/oracle.producer.jpdk.war,/fs1/FMW_Home/oracle_common/webcenter/modules/oracle.portlet.server_11.1.1/wc-producer-web-lib.war,/fs1/FMW_Home/oracle_common/webcenter/modules/oracle.portlet.server_11.1.1/wlp-producer-full-web-lib.war,/fs1/FMW_Home/oracle_common/webcenter/modules/oracle.portlet.server_11.1.1/wlp-light-core-web-lib.war,/fs1/FMW_Home/oracle_common/webcenter/modules/oracle.portlet.server_11.1.1/wlp-wsrp-producer-core-web-lib.war,/fs1/FMW_Home/oracle_common/webcenter/modules/oracle.portlet.server_11.1.1/wlp-framework-common-web-lib.war,/fs1/FMW_Home/wlserver_10.3/common/deployable-libraries/jstl-1.2.war,/fs1/EBSapps/comn/shared-libs/ebs-product,/fs1/EBSapps/comn/shared-libs/ebs-3rdparty,/fs1/FMW_Home/Oracle_EBS-app1/shared-libs/ebs-fmw' -compiler 'none' -keepgenerated '' /fs1/FMW_Home/Oracle_EBS-app1/applications/oacore/html '' <file>

      PARALLEL COMPILATION: 1

      [9309] translating: 17s elapsed, 200 successful 0 failed

      [9309] translating: 1m47s elapsed, 191 successful 0 failed

      TRANSLATED: 5991 [failed: 0] in 9m21s

      COMMAND: exec javac -nowarn <file>

      PARALLEL COMPILATION: 1

      [9309] !!COMPILATION ERROR(0) GepsibeCCtdSctPath.jsp:

      __gepsibecctdsctpath.java:304: error: no suitable method found for valueOf()

                  out.print( String.valueOf(/*IBEUtil.htmlEncode(supersections[i].getDisplayName())*/));

                                   ^

          method String.valueOf(double) is not applicable

            (actual and formal argument lists differ in length)

          method String.valueOf(float) is not applicable

            (actual and formal argument lists differ in length)

          method String.valueOf(long) is not applicable

            (actual and formal argument lists differ in length)

          method String.valueOf(int) is not applicable

            (actual and formal argument lists differ in length)

          method String.valueOf(char) is not applicable

            (actual and formal argument lists differ in length)

          method String.valueOf(boolean) is not applicable

            (actual and formal argument lists differ in length)

          method String.valueOf(char[],int,int) is not applicable

            (actual and formal argument lists differ in length)

          method String.valueOf(char[]) is not applicable

            (actual and formal argument lists differ in length)

          method String.valueOf(Object) is not applicable

            (actual and formal argument lists differ in length)

      __gepsibecctdsctpath.java:316: error: no suitable method found for valueOf()

                  out.print( String.valueOf(/*IBEUtil.htmlEncode(s.getDisplayName())*/));

                                   ^

          method String.valueOf(double) is not applicable

            (actual and formal argument lists differ in length)

      __gepsibecctdsctpath.java:316: error: no suitable method found for valueOf()

                  out.print( String.valueOf(/*IBEUtil.htmlEncode(s.getDisplayName())*/));

                                   ^

          method String.valueOf(double) is not applicable

            (actual and formal argument lists differ in length)

          method String.valueOf(float) is not applicable

            (actual and formal argument lists differ in length)

          method String.valueOf(long) is not applicable

            (actual and formal argument lists differ in length)

          method String.valueOf(int) is not applicable

            (actual and formal argument lists differ in length)

          method String.valueOf(char) is not applicable

            (actual and formal argument lists differ in length)

          method String.valueOf(boolean) is not applicable

            (actual and formal argument lists differ in length)

          method String.valueOf(char[],int,int) is not applicable

            (actual and formal argument lists differ in length)

          method String.valueOf(char[]) is not applicable

            (actual and formal argument lists differ in length)

          method String.valueOf(Object) is not applicable

            (actual and formal argument lists differ in length)

      Note: __gepsibecctdsctpath.java uses unchecked or unsafe operations.

      Note: Recompile with -Xlint:unchecked for details.

      2 errors

      =======================================================