1 2 Previous Next 19 Replies Latest reply on Mar 29, 2017 3:14 PM by Prashant Umap

    adop phase=fs_clone error on EBS 12.2.6

    1042232

      This is a fresh installation of EBS 12.2.6. I have applied the 12.2.6 update patch successfully. adop phase=cleanup went well. but the adop phase=fs_clone did not run with success.

       

      After applying 12.2.6 update patch I run the application but not autoconfig (it is necessary). then I run adop phase=cleanup.

       

      Here I have attached all the log output

      =================================================================

      [applprod@app7 ~]$ adop phase=fs_clone

      Enter the APPS password:
      Enter the SYSTEM password:
      Enter the WLSADMIN password:

      Validating credentials.

      Initializing.
          Run Edition context  : /u01/apps/PROD/fs1/inst/apps/PROD_app7/appl/admin/PROD_app7.xml
          Patch edition context: /u01/apps/PROD/fs2/inst/apps/PROD_app7/appl/admin/PROD_app7.xml
          Patch file system free space: 286.00 GB

      Validating system setup.
          Node registry is valid.

      Checking for existing adop sessions.
          No pending session exists.
          Starting new adop session.

      ===========================================================================
      ADOP (C.Delta.8)
      Session ID: 3
      Node: app7
      Phase: fs_clone
      Log: /u01/apps/PROD/fs_ne/EBSapps/log/adop/3/20170329_210613/adop.log
      ===========================================================================

      Validating configuration on node: [app7].
          Log: /u01/apps/PROD/fs_ne/EBSapps/log/adop/3/20170329_210613/fs_clone/validate/app7
            [WARNING]: There could be issues while validating the ports used for E-Business Suite instance against ports used in /etc/services. Refer the log file for more details.

      Checking for pending cleanup actions.
          No pending cleanup actions found.

      Blocking managed server ports.
          Log: /u01/apps/PROD/fs_ne/EBSapps/log/adop/3/20170329_210613/fs_clone/app7/txkCloneAcquirePort.log

      Performing CLONE steps.
          Log: /u01/apps/PROD/fs_ne/EBSapps/log/adop/3/20170329_210613/fs_clone/app7

       

      Beginning application tier FSCloneStage - Wed Mar 29 21:09:08 2017

      /u01/apps/PROD/fs1/EBSapps/comn/util/jdk32/bin/java -Xmx600M -DCONTEXT_VALIDATED=false -Doracle.installer.oui_loc=/oui -classpath /u01/apps/PROD/fs1/FMW_Home/webtier/lib/xmlparserv2.jar:/u01/apps/PROD/fs1/FMW_Home/webtier/jdbc/lib/ojdbc6.jar:/u01/apps/PROD/fs1/EBSapps/comn/java/classes:/u01/apps/PROD/fs1/FMW_Home/webtier/oui/jlib/OraInstaller.jar:/u01/apps/PROD/fs1/FMW_Home/webtier/oui/jlib/ewt3.jar:/u01/apps/PROD/fs1/FMW_Home/webtier/oui/jlib/share.jar:/u01/apps/PROD/fs1/FMW_Home/webtier/../Oracle_EBS-app1/oui/jlib/srvm.jar:/u01/apps/PROD/fs1/FMW_Home/webtier/jlib/ojmisc.jar:/u01/apps/PROD/fs1/FMW_Home/wlserver_10.3/server/lib/weblogic.jar:/u01/apps/PROD/fs1/FMW_Home/oracle_common/jlib/obfuscatepassword.jar  oracle.apps.ad.clone.FSCloneStageAppsTier -e /u01/apps/PROD/fs1/inst/apps/PROD_app7/appl/admin/PROD_app7.xml -targ /u01/apps/PROD/fs2/inst/apps/PROD_app7/appl/admin/PROD_app7.xml -stage /u01/apps/PROD/fs1/EBSapps/comn/adopclone_app7 -tmp /tmp -component appsTier -nopromptmsg
      Log file located at /u01/apps/PROD/fs1/inst/apps/PROD_app7/admin/log/clone/FSCloneStageAppsTier_03292109.log

      ERROR while running FSCloneStage...
      Wed Mar 29 21:10:16 2017
      *******FATAL ERROR*******
      PROGRAM : (/u01/apps/PROD/fs1/EBSapps/appl/ad/12.0.0/patch/115/bin/txkADOPPreparePhaseSynchronize.pl)
      TIME    : Wed Mar 29 21:10:16 2017
      FUNCTION: main::runFSCloneStage [ Level 1 ]
      ERRORMSG: /u01/apps/PROD/fs1/EBSapps/appl/ad/12.0.0/bin/adclone.pl did not go through successfully.

          [UNEXPECTED]Error occurred running "perl /u01/apps/PROD/fs1/EBSapps/appl/ad/12.0.0/patch/115/bin/txkADOPPreparePhaseSynchronize.pl -contextfile=/u01/apps/PROD/fs1/inst/apps/PROD_app7/appl/admin/PROD_app7.xml -patchcontextfile=/u01/apps/PROD/fs2/inst/apps/PROD_app7/appl/admin/PROD_app7.xml -promptmsg=hide -console=off -mode=create -sync_mode=copy -sessionid=3 -timestamp=20170329_210613 -outdir=/u01/apps/PROD/fs_ne/EBSapps/log/adop/3/20170329_210613/fs_clone/app7"
          [UNEXPECTED]occurred during CLONE Patch File System from Run File System, running command: "perl /u01/apps/PROD/fs1/EBSapps/appl/ad/12.0.0/patch/115/bin/txkADOPPreparePhaseSynchronize.pl -contextfile=/u01/apps/PROD/fs1/inst/apps/PROD_app7/appl/admin/PROD_app7.xml -patchcontextfile=/u01/apps/PROD/fs2/inst/apps/PROD_app7/appl/admin/PROD_app7.xml -promptmsg=hide -console=off -mode=create -sync_mode=copy -sessionid=3 -timestamp=20170329_210613 -outdir=/u01/apps/PROD/fs_ne/EBSapps/log/adop/3/20170329_210613/fs_clone/app7".
          Releasing managed server ports.
          Log: /u01/apps/PROD/fs_ne/EBSapps/log/adop/3/20170329_210613/fs_clone/app7/txkCloneAcquirePort.log
          Stopping services on patch file system.
          Stopping admin server.

      You are running adadminsrvctl.sh version 120.10.12020000.2


      The AdminServer is already shutdown

      adadminsrvctl.sh: exiting with status 2

      adadminsrvctl.sh: check the logfile /u01/apps/PROD/fs2/inst/apps/PROD_app7/logs/appl/admin/log/adadminsrvctl.txt for more information ... 

          Stopping node manager.

      You are running adnodemgrctl.sh version 120.11.12020000.4


      Either the Node Manager is not up or the credentials are incorrect.

      adnodemgrctl.sh: exiting with status 2

      adnodemgrctl.sh: check the logfile /u01/apps/PROD/fs2/inst/apps/PROD_app7/logs/appl/admin/log/adnodemgrctl.txt for more information ... 

          [UNEXPECTED]fs_clone has failed.


      [STATEMENT] Please run adopscanlog utility, using the command

      "adopscanlog -latest=yes"

      to get the list of the log files along with snippet of the error message corresponding to each log file.


      adop exiting with status = 2 (Fail)
      [applprod@app7 ~]$

       

       

      ===========================================================================================================================

       

      [applprod@app7 ~]$ more /u01/apps/PROD/fs_ne/EBSapps/log/adop/3/20170329_210613/adop.log
      [STATEMENT] Inside createPatchCtxFile().
      [START 2017/03/29 21:06:14] Arguments passed to adop
          phase=fs_clone
      [END   2017/03/29 21:06:14] Arguments passed to adop
      [STATEMENT] Verifying parameters
      [STATEMENT] Sourcing Run edition environment /u01/apps/PROD/fs1/EBSapps/appl/APPSPROD_app7.env

      [EVENT]     Validating system setup.
          [STATEMENT] Checking for required environment
          [PROCEDURE] Running: adpawc -nodisp
          [STATEMENT]  Using 28 workers (Default: 28, Recommended maximum limit: 57)
          [PROCEDURE] [START 2017/03/29 21:06:54] Identifying Admin server node
          [STATEMENT] Admin node : "app7"
          [PROCEDURE] [END   2017/03/29 21:06:54] Identifying Admin server node
          [EVENT]     Node registry is valid.
          [PROCEDURE] [START 2017/03/29 21:06:54] Performing database sanity checks
          [PROCEDURE] [END   2017/03/29 21:06:54] Performing database sanity checks
      [PROCEDURE] [START 2017/03/29 21:06:54] Acquiring lock on sessions table
      [STATEMENT] Locking ad_adop_sessions table for app7 with wait interval of 60 seconds and number of tries 2

      [PROCEDURE] [END   2017/03/29 21:06:54] Acquiring lock on sessions table

      [EVENT]     Checking for existing adop sessions.
          [PROCEDURE] [START 2017/03/29 21:06:54] Checking for any pending sessions
          [EVENT]     Checking for pending hotpatch session.
              [PROCEDURE] [START 2017/03/29 21:06:54] Checking active hotpatch session
              [STATEMENT] Fetching number of incomplete cycles for app7 having appltop_id=196.
              [STATEMENT] value of incomplete_session: "0"
              [PROCEDURE] [END   2017/03/29 21:06:54] Checking active hotpatch session
          [EVENT]     Checking for pending cleanup session.
              [PROCEDURE] [START 2017/03/29 21:06:54] Checking for active cleanup session
              [PROCEDURE] [END   2017/03/29 21:06:54] Checking for active cleanup session
          [PROCEDURE] [START 2017/03/29 21:06:54] Checking for existing fs_clone session
          [PROCEDURE] [END   2017/03/29 21:06:54] Checking for existing fs_clone session
          [STATEMENT] Master Session ID: NOT DEFINED
          [EVENT]     No pending session exists.
          [EVENT]     Starting new adop session.
              [PROCEDURE] [START 2017/03/29 21:06:54] Staging current session
              [PROCEDURE] [START 2017/03/29 21:06:54] Checking for hotpatch session
              [PROCEDURE] [END   2017/03/29 21:06:54] Checking for hotpatch session
              [STATEMENT] Fetching the node list where fs_clone or config clone did not complete
              [STATEMENT] Incomplete nodes: "app7"

              [STATEMENT] Fetching the node list where fs_clone or config clone completed successfully
              [STATEMENT] Completed nodes: ""

              [STATEMENT] An incomplete fs_clone session exists: "ADOP Session ID:3"
              [STATEMENT] 'CLONE' entry found
              [STATEMENT] SQL Statment : "    update ad_adop_session_patches
           set status='N'
           where bug_number='CLONE' and adop_session_id=3
          and node_name='app7'
      "
              [STATEMENT] Continuing 'CLONE' from previous state for host: app7 and session ID: 3
              [PROCEDURE] [END   2017/03/29 21:06:55] Staging current session
      [PROCEDURE] [START 2017/03/29 21:06:55] Unlocking sessions table
      [STATEMENT] Unlocking ad_adop_sessions table for app7 with wait interval of 60 seconds and number of tries 2

      [PROCEDURE] [END   2017/03/29 21:06:55] Unlocking sessions table
      [PROCEDURE] [START 2017/03/29 21:06:55] Running adzdoptl.pl

      ===========================================================================
      ADOP (C.Delta.8)
      Session ID: 3
      Node: app7
      Phase: fs_clone
      Log: /u01/apps/PROD/fs_ne/EBSapps/log/adop/3/20170329_210613/adop.log
      ===========================================================================
      [STATEMENT] Patch file system context file exists

      [EVENT]     Validating configuration on node: [app7].
          [STATEMENT] Calling task: "Executing txkADOPValidation script on app7"; script: "/u01/apps/PROD/fs1/EBSapps/appl/ad/12.0.0/patch/115/bin/txkADOPValidations.pl"; args: " -cont
      extfile=/u01/apps/PROD/fs1/inst/apps/PROD_app7/appl/admin/PROD_app7.xml -patchctxfile=/u01/apps/PROD/fs2/inst/apps/PROD_app7/appl/admin/PROD_app7.xml -phase=fs_clone -logloc=/u01
      /apps/PROD/fs_ne/EBSapps/log/adop/3/20170329_210613/fs_clone/validate/app7 -promptmsg=hide"
          [PROCEDURE] [START 2017/03/29 21:06:55] Executing txkADOPValidation script on app7
          [PROCEDURE] Calling: /u01/apps/PROD/fs1/EBSapps/appl/ad/12.0.0/patch/115/bin/txkADOPValidations.pl
          [EVENT]     Log: /u01/apps/PROD/fs_ne/EBSapps/log/adop/3/20170329_210613/fs_clone/validate/app7
          [PROCEDURE] [END   2017/03/29 21:08:13] Executing txkADOPValidation script on app7
      [PROCEDURE] [START 2017/03/29 21:08:13] Running fs_clone phase
      [PROCEDURE] [START 2017/03/29 21:08:13] Running fs_clone

      [EVENT]     Checking for pending cleanup actions.
          [PROCEDURE] [START 2017/03/29 21:08:14] Checking for pending cleanup actions
          [EVENT]     No pending cleanup actions found.
          [PROCEDURE] [END   2017/03/29 21:08:14] Checking for pending cleanup actions

      [EVENT]     Blocking managed server ports.
          [PROCEDURE] [START 2017/03/29 21:08:14] Blocking ports
          [STATEMENT] Calling task: "Blocking ports on app7"; script: "/u01/apps/PROD/fs1/inst/apps/PROD_app7/admin/install/txkCloneAcquirePort.pl"; args: " -option=listen -server=app7
      .luminataerp.com -ports=5557,7002,7602,7402,7202,7802,6101,6201,10000 -log=/u01/apps/PROD/fs_ne/EBSapps/log/adop/3/20170329_210613/fs_clone/app7/txkCloneAcquirePort.log"
          [PROCEDURE] [START 2017/03/29 21:08:15] Blocking ports on app7
          [PROCEDURE] Calling: /u01/apps/PROD/fs1/inst/apps/PROD_app7/admin/install/txkCloneAcquirePort.pl
          [EVENT]     Log: /u01/apps/PROD/fs_ne/EBSapps/log/adop/3/20170329_210613/fs_clone/app7/txkCloneAcquirePort.log
          [PROCEDURE] [END   2017/03/29 21:09:05] Blocking ports on app7
          [PROCEDURE] [END   2017/03/29 21:09:05] Blocking ports
      [PROCEDURE] [START 2017/03/29 21:09:05] Updating status of patches
      [PROCEDURE] [START 2017/03/29 21:09:05] Updating session process ID
      [PROCEDURE] [END   2017/03/29 21:09:05] Updating session process ID
      [STATEMENT] SQL statement : "  update ad_adop_session_patches
        set status='R'
        where applied_file_system_base = '/u01/apps/PROD/fs1' and
        patch_file_system_base = '/u01/apps/PROD/fs2' and bug_number='CLONE' and status <> 'Y'
        and appltop_id=196 and node_name='app7'"
      [PROCEDURE] [END   2017/03/29 21:09:05] Updating status of patches

      [EVENT]     Performing CLONE steps.
          [PROCEDURE] [START 2017/03/29 21:09:05] CLONE Patch File System from Run File System
          [PROCEDURE] Calling: /u01/apps/PROD/fs1/EBSapps/appl/ad/12.0.0/patch/115/bin/txkADOPPreparePhaseSynchronize.pl
          [EVENT]     Log: /u01/apps/PROD/fs_ne/EBSapps/log/adop/3/20170329_210613/fs_clone/app7
          [UNEXPECTED]Error occurred running "perl /u01/apps/PROD/fs1/EBSapps/appl/ad/12.0.0/patch/115/bin/txkADOPPreparePhaseSynchronize.pl -contextfile=/u01/apps/PROD/fs1/inst/apps/P
      ROD_app7/appl/admin/PROD_app7.xml -patchcontextfile=/u01/apps/PROD/fs2/inst/apps/PROD_app7/appl/admin/PROD_app7.xml -promptmsg=hide -console=off -mode=create -sync_mode=copy -ses
      sionid=3 -timestamp=20170329_210613 -outdir=/u01/apps/PROD/fs_ne/EBSapps/log/adop/3/20170329_210613/fs_clone/app7"
          [UNEXPECTED]occurred during CLONE Patch File System from Run File System, running command: "perl /u01/apps/PROD/fs1/EBSapps/appl/ad/12.0.0/patch/115/bin/txkADOPPreparePhaseSy
      nchronize.pl -contextfile=/u01/apps/PROD/fs1/inst/apps/PROD_app7/appl/admin/PROD_app7.xml -patchcontextfile=/u01/apps/PROD/fs2/inst/apps/PROD_app7/appl/admin/PROD_app7.xml -promp
      tmsg=hide -console=off -mode=create -sync_mode=copy -sessionid=3 -timestamp=20170329_210613 -outdir=/u01/apps/PROD/fs_ne/EBSapps/log/adop/3/20170329_210613/fs_clone/app7".
          [EVENT]     Releasing managed server ports.
              [PROCEDURE] [START 2017/03/29 21:10:16] Releasing ports
              [STATEMENT] Calling task: "Releasing ports on app7"; script: "/u01/apps/PROD/fs1/inst/apps/PROD_app7/admin/install/txkCloneAcquirePort.pl"; args: " -option=close -server=
      app7.luminataerp.com -ports=5557,7002,7602,7402,7202,7802,6101,6201,10000 -log=/u01/apps/PROD/fs_ne/EBSapps/log/adop/3/20170329_210613/fs_clone/app7/txkCloneAcquirePort.log"
              [PROCEDURE] [START 2017/03/29 21:10:16] Releasing ports on app7
              [PROCEDURE] Calling: /u01/apps/PROD/fs1/inst/apps/PROD_app7/admin/install/txkCloneAcquirePort.pl
              [EVENT]     Log: /u01/apps/PROD/fs_ne/EBSapps/log/adop/3/20170329_210613/fs_clone/app7/txkCloneAcquirePort.log
              [PROCEDURE] [END   2017/03/29 21:10:17] Releasing ports on app7
              [PROCEDURE] [END   2017/03/29 21:10:17] Releasing ports
          [PROCEDURE] [START 2017/03/29 21:10:17] Updating status of patches
          [STATEMENT] SQL statement : "  update ad_adop_session_patches
        set status='F'
        where applied_file_system_base = '/u01/apps/PROD/fs1' and
        patch_file_system_base = '/u01/apps/PROD/fs2' and bug_number='CLONE' and status <> 'Y'
        and appltop_id=196 and node_name='app7'"
          [PROCEDURE] [END   2017/03/29 21:10:17] Updating status of patches
          [EVENT]     Stopping services on patch file system.
              [EVENT]     Stopping admin server.
                  [PROCEDURE] [START 2017/03/29 21:10:17] Check and stop patch Admin Server
                  [PROCEDURE] [START 2017/03/29 21:10:17] Check and Stop patch FS Admin Server
                  [PROCEDURE] [END   2017/03/29 21:10:19] Check and Stop patch FS Admin Server
                  [PROCEDURE] [END   2017/03/29 21:10:19] Check and stop patch Admin Server
              [EVENT]     Stopping node manager.
                  [PROCEDURE] [START 2017/03/29 21:10:19] Check and stop patch Node Manager
                  [PROCEDURE] [START 2017/03/29 21:10:20] Check and Stop patch Node Manager
                  [PROCEDURE] [END   2017/03/29 21:10:23] Check and Stop patch Node Manager
                  [PROCEDURE] [END   2017/03/29 21:10:23] Check and stop patch Node Manager
          [UNEXPECTED]fs_clone has failed.
          [PROCEDURE] [START 2017/03/29 21:10:23] Unlocking sessions table
          [STATEMENT] Unlocking ad_adop_sessions table for app7 with wait interval of 60 seconds and number of tries 2

          [PROCEDURE] [END   2017/03/29 21:10:23] Unlocking sessions table
      [applprod@app7 ~]$

      =====================================================================================================

      [applprod@app7 ~]$ more /u01/apps/PROD/fs_ne/EBSapps/log/adop/3/20170329_210613/fs_clone/app7/txkCloneAcquirePort.log
      Script Name    : txkCloneAcquirePort.pl
      Started        : Wed Mar 29 21:08:15 BDT 2017

      Attempting to open socket on port 5557

      Attempting to open socket on port 7002

      Attempting to open socket on port 7602

      Attempting to open socket on port 7402

      Attempting to open socket on port 7202

      Attempting to open socket on port 7802

      Attempting to open socket on port 6101

      Attempting to open socket on port 6201

      Attempting to open socket on port 10000

      Waiting for all child to complete

      PID listening port 5557 is 67003

      PID listening port 7002 is 67004

      PID listening port 7602 is 67006

      PID listening port 7402 is 67012

      PID listening port 7202 is 67013

      PID listening port 7802 is 67058

      PID listening port 6101 is 67060

      PID listening port 6201 is 67061

      PID listening port 10000 is 67062

      Completed      : Wed Mar 29 21:09:05 BDT 2017

      Script Name    : txkCloneAcquirePort.pl
      Started        : Wed Mar 29 21:10:17 BDT 2017

      Attempting to close socket on port 5557

      Attempting to close socket on port 7002

      Attempting to close socket on port 7602

      Attempting to close socket on port 7402

      Attempting to close socket on port 7202

      Attempting to close socket on port 7802

      Attempting to close socket on port 6101

      Attempting to close socket on port 6201

      Attempting to close socket on port 10000

      Terminating PID 67003

      Terminating PID 67004

      Terminating PID 67006

      Terminating PID 67012

      Terminating PID 67013

      Terminating PID 67058

      Terminating PID 67060

      Terminating PID 67061

      Terminating PID 67062

      Completed      : Wed Mar 29 21:10:17 BDT 2017

      [applprod@app7 ~]$

      =============================================================================================

      [applprod@app7 ~]$ more /u01/apps/PROD/fs1/inst/apps/PROD_app7/admin/log/clone/FSCloneStageAppsTier_03292109.log
      #############################################################
      Started FSCloneStageAppsTier at Wed Mar 29 21:09:09 BDT 2017
      Version:
              FSCloneStageAppsTier.java       :       120.1.12020000.12
      #############################################################
      Removing existing stage /u01/apps/PROD/fs1/EBSapps/comn/adopclone_app7/appsts
      Removing existing stage /u01/apps/PROD/fs1/EBSapps/comn/adopclone_app7/appl
      AdminServer is in RUNNING mode.
      ------ Set WLS password ------
      ------ Passing the apps password to apps Tier ------
      runMSList size: 5

      ---------------------------------------------------------------
                         ADX Database Utility                       
      ---------------------------------------------------------------

      getConnectionUsingAppsJDBCConnector() -->
          APPS_JDBC_URL='jdbc:oracle:thin:@(DESCRIPTION=(ADDRESS_LIST=(LOAD_BALANCE=YES)(FAILOVER=YES)(ADDRESS=(PROTOCOL=tcp)(HOST=app7.luminataerp.com)(PORT=1521)))(CONNECT_DATA=(SERV
      ICE_NAME=PROD)))'
          Trying to connect using APPS_JDBC_URL
          Connection obtained.

      -------------------ADX Database Utility Finished---------------

      patchMSList size: 5

      START: Calling StageAppsTier...

      START: Calling StageAppsTechStack...

      START: Creating Staging Area
      Creating bin directory
      UNZIP used: UnZip 5.50 of 17 February 2002, by Info-ZIP.  Maintained by C. Spieler.  Send
      Copying /u01/apps/PROD/fs1/EBSapps/appl/ad/12.0.0/admin/template/adxmlctx.tmp to /u01/apps/PROD/fs1/EBSapps/comn/adopclone_app7//context/apps/adxmlctx.tmp
      Creating html directory
      Creating jre directory
      Directory /u01/apps/PROD/fs1/EBSapps/comn/adopclone_app7/jre already exists.
      Attempting to delete: /u01/apps/PROD/fs1/EBSapps/comn/adopclone_app7/jre
      Cloning Stage Area already exists, updating existing area.
      Creating jlib directory
      Copied /u01/apps/PROD/fs1/FMW_Home/webtier/lib/xmlparserv2.jar to /u01/apps/PROD/fs1/EBSapps/comn/adopclone_app7/jlib/xmlparserv2.jar
      Copied /u01/apps/PROD/fs1/EBSapps/comn/java/classes/oracle/apps/ad to /u01/apps/PROD/fs1/EBSapps/comn/adopclone_app7/jlib/java/oracle/apps
      Copying /u01/apps/PROD/fs1/FMW_Home/wlserver_10.3/server/lib//weblogic.jar to /u01/apps/PROD/fs1/EBSapps/comn/adopclone_app7/jlib
      Copying /u01/apps/PROD/fs1/FMW_Home/wlserver_10.3/server/lib//wljmxclient.jar to /u01/apps/PROD/fs1/EBSapps/comn/adopclone_app7/jlib
      Copying /u01/apps/PROD/fs1/FMW_Home/wlserver_10.3/server/lib//wlclient.jar to /u01/apps/PROD/fs1/EBSapps/comn/adopclone_app7/jlib
      Copying /u01/apps/PROD/fs1/FMW_Home/webtier/opmn/lib/wlfullclient.jar to /u01/apps/PROD/fs1/EBSapps/comn/adopclone_app7/jlib
      Copying /u01/apps/PROD/fs1/FMW_Home/oracle_common/jlib/obfuscatepassword.jar to /u01/apps/PROD/fs1/EBSapps/comn/adopclone_app7/jlib
      Copying /u01/apps/PROD/fs1/FMW_Home/oracle_common/oui/jlib/ojmisc.jar to /u01/apps/PROD/fs1/EBSapps/comn/adopclone_app7/jlib
      Copying /u01/apps/PROD/fs1/FMW_Home/webtier/oui/jlib/emCfg.jar to /u01/apps/PROD/fs1/EBSapps/comn/adopclone_app7/jlib
      Copied /u01/apps/PROD/fs1/EBSapps/comn/java/classes/oracle/apps/fnd/txk/util/UpdateDomainT2PMovePlan.class to /u01/apps/PROD/fs1/EBSapps/comn/adopclone_app7/jlib/java/oracle/apps
      /fnd/txk
      Copied /u01/apps/PROD/fs1/FMW_Home/webtier/jdbc/lib/ojdbc5.jar to /u01/apps/PROD/fs1/EBSapps/comn/adopclone_app7/jlib/ojdbc5.jar
      Copied /u01/apps/PROD/fs1/FMW_Home/webtier/jdbc/lib/ojdbc6.jar to /u01/apps/PROD/fs1/EBSapps/comn/adopclone_app7/jlib/ojdbc6.jar
      Copying file from /u01/apps/PROD/fs1/EBSapps/appl/ad/12.0.0/bin to /u01/apps/PROD/fs1/EBSapps/comn/adopclone_app7/bin
      Testing if this home is s_weboh_oh...
      This home is not s_weboh_oh...will procede with getOUI method...
      Copy OUI from /u01/apps/PROD/fs1/EBSapps/10.1.2/oui/jlib to /u01/apps/PROD/fs1/EBSapps/comn/adopclone_app7//jlib/oui/
      copying /u01/apps/PROD/fs1/EBSapps/comn/adopclone_app7//jlib/oui//jlib/oneclick.jar
      copying /u01/apps/PROD/fs1/EBSapps/comn/adopclone_app7//jlib/oui//jlib/InstHelp.jar
      copying /u01/apps/PROD/fs1/EBSapps/comn/adopclone_app7//jlib/oui//jlib/OraInstallerNet.jar
      copying /u01/apps/PROD/fs1/EBSapps/comn/adopclone_app7//jlib/oui//jlib/OraInstaller.jar
      copying /u01/apps/PROD/fs1/EBSapps/comn/adopclone_app7//jlib/oui//jlib/InstImages.jar
      copying /u01/apps/PROD/fs1/EBSapps/comn/adopclone_app7//jlib/oui//jlib/ewt3-nls.jar
      copying /u01/apps/PROD/fs1/EBSapps/comn/adopclone_app7//jlib/oui//jlib/share.jar
      copying /u01/apps/PROD/fs1/EBSapps/comn/adopclone_app7//jlib/oui//jlib/prereq.jar
      copying /u01/apps/PROD/fs1/EBSapps/comn/adopclone_app7//jlib/oui//jlib/emocmutl.jar
      copying /u01/apps/PROD/fs1/EBSapps/comn/adopclone_app7//jlib/oui//jlib/help4-nls.jar
      copying /u01/apps/PROD/fs1/EBSapps/comn/adopclone_app7//jlib/oui//jlib/ewt3.jar
      copying /u01/apps/PROD/fs1/EBSapps/comn/adopclone_app7//jlib/oui//jlib/ouica.jar
      copying /u01/apps/PROD/fs1/EBSapps/comn/adopclone_app7//jlib/oui//jlib/oracle_ice.jar
      copying /u01/apps/PROD/fs1/EBSapps/comn/adopclone_app7//jlib/oui//jlib/srvm.jar
      copying /u01/apps/PROD/fs1/EBSapps/comn/adopclone_app7//jlib/oui//jlib/help4.jar
      copying /u01/apps/PROD/fs1/EBSapps/comn/adopclone_app7//jlib/oui//jlib/jewt4.jar
      copying /u01/apps/PROD/fs1/EBSapps/comn/adopclone_app7//jlib/oui//jlib/classes12.jar
      copying /u01/apps/PROD/fs1/EBSapps/comn/adopclone_app7//jlib/oui//jlib/swingaccess.jar
      copying /u01/apps/PROD/fs1/EBSapps/comn/adopclone_app7//jlib/oui//jlib/jewt4-nls.jar
      copying /u01/apps/PROD/fs1/EBSapps/comn/adopclone_app7//jlib/oui//jlib/ewt3-swingaccess.jar
      copying /u01/apps/PROD/fs1/EBSapps/comn/adopclone_app7//jlib/oui//jlib/xmlparserv2.jar
      Copy OUI from /u01/apps/PROD/fs1/EBSapps/10.1.2/oui/lib to /u01/apps/PROD/fs1/EBSapps/comn/adopclone_app7//oui/
      Creating FMW staging directories
      Creating log directory
      Creating OHS instance archive stage directory
      Creating Weblogic domain archive stage directory
      Creating t2pjdk directory
      Creating prereq/webtier directory
      Attempting to delete: /u01/apps/PROD/fs1/EBSapps/comn/adopclone_app7//prereq
      Copying /u01/apps/PROD/fs1/FMW_Home/webtier/oui to /u01/apps/PROD/fs1/EBSapps/comn/adopclone_app7//prereq/webtier
      Copying /u01/apps/PROD/fs1/FMW_Home/webtier/inventory/Scripts to /u01/apps/PROD/fs1/EBSapps/comn/adopclone_app7//prereq/webtier

      END: Creating Staging Area

      START: Home Clonable
      Updating ORACLE_HOME clone drivers: /u01/apps/PROD/fs1/EBSapps/10.1.2/
      Completed update to ORACLE_HOME clone drivers. Wed Mar 29 21:09:36 BDT 2017
      Running ORACLE_HOME clone drivers: /u01/apps/PROD/fs1/EBSapps/10.1.2/appsutil/driver/preclone.drv

      Binary copy of /u01/apps/PROD/fs1/EBSapps/appl/ad/12.0.0/admin/template/adregtools.drv to /u01/apps/PROD/fs1/EBSapps/10.1.2/appsutil/driver/regclone.drv

      Binary copy of /u01/apps/PROD/fs1/EBSapps/appl/ad/12.0.0/admin/template/adouitools.pl to /u01/apps/PROD/fs1/EBSapps/10.1.2/appsutil/template/adouitools.pl

      Binary copy of /u01/apps/PROD/fs1/EBSapps/appl/ad/12.0.0/admin/template/adlnk806.sh to /u01/apps/PROD/fs1/EBSapps/10.1.2/appsutil/template/adlnktools.sh

      Binary copy of /u01/apps/PROD/fs1/EBSapps/appl/fnd/12.0.0/admin/template/txkstubcfg1012.pl to /u01/apps/PROD/fs1/EBSapps/10.1.2/appsutil/template/txkstubcfg1012.pl

      Binary copy of /u01/apps/PROD/fs1/EBSapps/appl/fnd/12.0.0/admin/template/ftrace_cfg_1012.tmp to /u01/apps/PROD/fs1/EBSapps/10.1.2/appsutil/template/ftrace_cfg_1012.tmp

      Completed update to ORACLE_HOME clone drivers. Wed Mar 29 21:09:37 BDT 2017

      END: Home Clonable
      Done...

      END: Calling StageAppsTechStack...

      START: Calling StageApplTop...

      START: Preparing to stage the appl_top.
      Wed Mar 29 21:09:37 BDT 2017

      START: Creating Staging Area
      Creating bin directory
      Copying /u01/apps/PROD/fs1/EBSapps/appl/ad/12.0.0/admin/template/adxmlctx.tmp to /u01/apps/PROD/fs1/EBSapps/comn/adopclone_app7//context/apps/adxmlctx.tmp
      Creating html directory
      Creating jre directory
      Directory /u01/apps/PROD/fs1/EBSapps/comn/adopclone_app7/jre already exists.
      Attempting to delete: /u01/apps/PROD/fs1/EBSapps/comn/adopclone_app7/jre
      Cloning Stage Area already exists, updating existing area.
      Creating jlib directory
      Copied /u01/apps/PROD/fs1/FMW_Home/webtier/lib/xmlparserv2.jar to /u01/apps/PROD/fs1/EBSapps/comn/adopclone_app7/jlib/xmlparserv2.jar
      Copied /u01/apps/PROD/fs1/EBSapps/comn/java/classes/oracle/apps/ad to /u01/apps/PROD/fs1/EBSapps/comn/adopclone_app7/jlib/java/oracle/apps
      Copying /u01/apps/PROD/fs1/FMW_Home/wlserver_10.3/server/lib//weblogic.jar to /u01/apps/PROD/fs1/EBSapps/comn/adopclone_app7/jlib
      Copying /u01/apps/PROD/fs1/FMW_Home/wlserver_10.3/server/lib//wljmxclient.jar to /u01/apps/PROD/fs1/EBSapps/comn/adopclone_app7/jlib
      Copying /u01/apps/PROD/fs1/FMW_Home/wlserver_10.3/server/lib//wlclient.jar to /u01/apps/PROD/fs1/EBSapps/comn/adopclone_app7/jlib
      Copying /u01/apps/PROD/fs1/FMW_Home/webtier/opmn/lib/wlfullclient.jar to /u01/apps/PROD/fs1/EBSapps/comn/adopclone_app7/jlib
      Copying /u01/apps/PROD/fs1/FMW_Home/oracle_common/jlib/obfuscatepassword.jar to /u01/apps/PROD/fs1/EBSapps/comn/adopclone_app7/jlib
      Copying /u01/apps/PROD/fs1/FMW_Home/oracle_common/oui/jlib/ojmisc.jar to /u01/apps/PROD/fs1/EBSapps/comn/adopclone_app7/jlib
      Copying /u01/apps/PROD/fs1/FMW_Home/webtier/oui/jlib/emCfg.jar to /u01/apps/PROD/fs1/EBSapps/comn/adopclone_app7/jlib
      Copied /u01/apps/PROD/fs1/EBSapps/comn/java/classes/oracle/apps/fnd/txk/util/UpdateDomainT2PMovePlan.class to /u01/apps/PROD/fs1/EBSapps/comn/adopclone_app7/jlib/java/oracle/apps
      /fnd/txk
      Copied /u01/apps/PROD/fs1/FMW_Home/webtier/jdbc/lib/ojdbc5.jar to /u01/apps/PROD/fs1/EBSapps/comn/adopclone_app7/jlib/ojdbc5.jar
      Copied /u01/apps/PROD/fs1/FMW_Home/webtier/jdbc/lib/ojdbc6.jar to /u01/apps/PROD/fs1/EBSapps/comn/adopclone_app7/jlib/ojdbc6.jar
      Copying file from /u01/apps/PROD/fs1/EBSapps/appl/ad/12.0.0/bin to /u01/apps/PROD/fs1/EBSapps/comn/adopclone_app7/bin
      Testing if this home is s_weboh_oh...
      This home is not s_weboh_oh...will procede with getOUI method...
      Copy OUI from /u01/apps/PROD/fs1/EBSapps/10.1.2/oui/jlib to /u01/apps/PROD/fs1/EBSapps/comn/adopclone_app7//jlib/oui/
      copying /u01/apps/PROD/fs1/EBSapps/comn/adopclone_app7//jlib/oui//jlib/oneclick.jar
      copying /u01/apps/PROD/fs1/EBSapps/comn/adopclone_app7//jlib/oui//jlib/InstHelp.jar
      copying /u01/apps/PROD/fs1/EBSapps/comn/adopclone_app7//jlib/oui//jlib/OraInstallerNet.jar
      copying /u01/apps/PROD/fs1/EBSapps/comn/adopclone_app7//jlib/oui//jlib/OraInstaller.jar
      copying /u01/apps/PROD/fs1/EBSapps/comn/adopclone_app7//jlib/oui//jlib/InstImages.jar
      copying /u01/apps/PROD/fs1/EBSapps/comn/adopclone_app7//jlib/oui//jlib/ewt3-nls.jar
      copying /u01/apps/PROD/fs1/EBSapps/comn/adopclone_app7//jlib/oui//jlib/share.jar
      copying /u01/apps/PROD/fs1/EBSapps/comn/adopclone_app7//jlib/oui//jlib/prereq.jar
      copying /u01/apps/PROD/fs1/EBSapps/comn/adopclone_app7//jlib/oui//jlib/emocmutl.jar
      copying /u01/apps/PROD/fs1/EBSapps/comn/adopclone_app7//jlib/oui//jlib/help4-nls.jar
      copying /u01/apps/PROD/fs1/EBSapps/comn/adopclone_app7//jlib/oui//jlib/ewt3.jar
      copying /u01/apps/PROD/fs1/EBSapps/comn/adopclone_app7//jlib/oui//jlib/ouica.jar
      copying /u01/apps/PROD/fs1/EBSapps/comn/adopclone_app7//jlib/oui//jlib/oracle_ice.jar
      copying /u01/apps/PROD/fs1/EBSapps/comn/adopclone_app7//jlib/oui//jlib/srvm.jar
      copying /u01/apps/PROD/fs1/EBSapps/comn/adopclone_app7//jlib/oui//jlib/help4.jar
      copying /u01/apps/PROD/fs1/EBSapps/comn/adopclone_app7//jlib/oui//jlib/jewt4.jar
      copying /u01/apps/PROD/fs1/EBSapps/comn/adopclone_app7//jlib/oui//jlib/classes12.jar
      copying /u01/apps/PROD/fs1/EBSapps/comn/adopclone_app7//jlib/oui//jlib/swingaccess.jar
      copying /u01/apps/PROD/fs1/EBSapps/comn/adopclone_app7//jlib/oui//jlib/jewt4-nls.jar
      copying /u01/apps/PROD/fs1/EBSapps/comn/adopclone_app7//jlib/oui//jlib/ewt3-swingaccess.jar
      copying /u01/apps/PROD/fs1/EBSapps/comn/adopclone_app7//jlib/oui//jlib/xmlparserv2.jar
      Copy OUI from /u01/apps/PROD/fs1/EBSapps/10.1.2/oui/lib to /u01/apps/PROD/fs1/EBSapps/comn/adopclone_app7//oui/
      Creating FMW staging directories
      Creating log directory
      Creating OHS instance archive stage directory
      Creating Weblogic domain archive stage directory
      Creating t2pjdk directory
      Creating prereq/webtier directory
      Attempting to delete: /u01/apps/PROD/fs1/EBSapps/comn/adopclone_app7//prereq
      Copying /u01/apps/PROD/fs1/FMW_Home/webtier/oui to /u01/apps/PROD/fs1/EBSapps/comn/adopclone_app7//prereq/webtier
      Copying /u01/apps/PROD/fs1/FMW_Home/webtier/inventory/Scripts to /u01/apps/PROD/fs1/EBSapps/comn/adopclone_app7//prereq/webtier

      END: Creating Staging Area

      END:Successfully prepared appl_top for staging. Wed Mar 29 21:09:57 BDT 2017

      START: Creating zip files for appltop.
      Wed Mar 29 21:09:57 BDT 2017
      Done...

      END: Successfully created zip files.
      Wed Mar 29 21:09:57 BDT 2017

      END: Calling StageApplTop...
      Setting the WLS AdminServer password for StagewlsTechStack
      Setting the Apps password for StagewlsTechStack

      START: Calling StagefmwTechStack...
      Evaluated internal cloning stage: /u01/apps/PROD/fs1/EBSapps/comn/clone

      START: Creating FMW Stage Area
      Creating bin directory
      Copying /u01/apps/PROD/fs1/EBSapps/appl/ad/12.0.0/admin/template/adxmlctx.tmp to /u01/apps/PROD/fs1/EBSapps/comn/adopclone_app7//context/apps/adxmlctx.tmp
      Creating html directory
      Creating jre directory
      Directory /u01/apps/PROD/fs1/EBSapps/comn/adopclone_app7/jre already exists.
      Attempting to delete: /u01/apps/PROD/fs1/EBSapps/comn/adopclone_app7/jre
      Cloning Stage Area already exists, updating existing area.
      Creating jlib directory
      Copied /u01/apps/PROD/fs1/FMW_Home/webtier/lib/xmlparserv2.jar to /u01/apps/PROD/fs1/EBSapps/comn/adopclone_app7/jlib/xmlparserv2.jar
      Copied /u01/apps/PROD/fs1/EBSapps/comn/java/classes/oracle/apps/ad to /u01/apps/PROD/fs1/EBSapps/comn/adopclone_app7/jlib/java/oracle/apps
      Copying /u01/apps/PROD/fs1/FMW_Home/wlserver_10.3/server/lib//weblogic.jar to /u01/apps/PROD/fs1/EBSapps/comn/adopclone_app7/jlib
      Copying /u01/apps/PROD/fs1/FMW_Home/wlserver_10.3/server/lib//wljmxclient.jar to /u01/apps/PROD/fs1/EBSapps/comn/adopclone_app7/jlib
      Copying /u01/apps/PROD/fs1/FMW_Home/wlserver_10.3/server/lib//wlclient.jar to /u01/apps/PROD/fs1/EBSapps/comn/adopclone_app7/jlib
      Copying /u01/apps/PROD/fs1/FMW_Home/webtier/opmn/lib/wlfullclient.jar to /u01/apps/PROD/fs1/EBSapps/comn/adopclone_app7/jlib
      Copying /u01/apps/PROD/fs1/FMW_Home/oracle_common/jlib/obfuscatepassword.jar to /u01/apps/PROD/fs1/EBSapps/comn/adopclone_app7/jlib
      Copying /u01/apps/PROD/fs1/FMW_Home/oracle_common/oui/jlib/ojmisc.jar to /u01/apps/PROD/fs1/EBSapps/comn/adopclone_app7/jlib
      Copying /u01/apps/PROD/fs1/FMW_Home/webtier/oui/jlib/emCfg.jar to /u01/apps/PROD/fs1/EBSapps/comn/adopclone_app7/jlib
      Copied /u01/apps/PROD/fs1/EBSapps/comn/java/classes/oracle/apps/fnd/txk/util/UpdateDomainT2PMovePlan.class to /u01/apps/PROD/fs1/EBSapps/comn/adopclone_app7/jlib/java/oracle/apps
      /fnd/txk
      Copied /u01/apps/PROD/fs1/FMW_Home/webtier/jdbc/lib/ojdbc5.jar to /u01/apps/PROD/fs1/EBSapps/comn/adopclone_app7/jlib/ojdbc5.jar
      Copied /u01/apps/PROD/fs1/FMW_Home/webtier/jdbc/lib/ojdbc6.jar to /u01/apps/PROD/fs1/EBSapps/comn/adopclone_app7/jlib/ojdbc6.jar
      Copying file from /u01/apps/PROD/fs1/EBSapps/appl/ad/12.0.0/bin to /u01/apps/PROD/fs1/EBSapps/comn/adopclone_app7/bin
      Testing if this home is s_weboh_oh...
      This home is not s_weboh_oh...will procede with getOUI method...
      Copy OUI from /u01/apps/PROD/fs1/EBSapps/10.1.2/oui/jlib to /u01/apps/PROD/fs1/EBSapps/comn/adopclone_app7//jlib/oui/
      copying /u01/apps/PROD/fs1/EBSapps/comn/adopclone_app7//jlib/oui//jlib/oneclick.jar
      copying /u01/apps/PROD/fs1/EBSapps/comn/adopclone_app7//jlib/oui//jlib/InstHelp.jar
      copying /u01/apps/PROD/fs1/EBSapps/comn/adopclone_app7//jlib/oui//jlib/OraInstallerNet.jar
      copying /u01/apps/PROD/fs1/EBSapps/comn/adopclone_app7//jlib/oui//jlib/OraInstaller.jar
      copying /u01/apps/PROD/fs1/EBSapps/comn/adopclone_app7//jlib/oui//jlib/InstImages.jar
      copying /u01/apps/PROD/fs1/EBSapps/comn/adopclone_app7//jlib/oui//jlib/ewt3-nls.jar
      copying /u01/apps/PROD/fs1/EBSapps/comn/adopclone_app7//jlib/oui//jlib/share.jar
      copying /u01/apps/PROD/fs1/EBSapps/comn/adopclone_app7//jlib/oui//jlib/prereq.jar
      copying /u01/apps/PROD/fs1/EBSapps/comn/adopclone_app7//jlib/oui//jlib/emocmutl.jar
      copying /u01/apps/PROD/fs1/EBSapps/comn/adopclone_app7//jlib/oui//jlib/help4-nls.jar
      copying /u01/apps/PROD/fs1/EBSapps/comn/adopclone_app7//jlib/oui//jlib/ewt3.jar
      copying /u01/apps/PROD/fs1/EBSapps/comn/adopclone_app7//jlib/oui//jlib/ouica.jar
      copying /u01/apps/PROD/fs1/EBSapps/comn/adopclone_app7//jlib/oui//jlib/oracle_ice.jar
      copying /u01/apps/PROD/fs1/EBSapps/comn/adopclone_app7//jlib/oui//jlib/srvm.jar
      copying /u01/apps/PROD/fs1/EBSapps/comn/adopclone_app7//jlib/oui//jlib/help4.jar
      copying /u01/apps/PROD/fs1/EBSapps/comn/adopclone_app7//jlib/oui//jlib/jewt4.jar
      copying /u01/apps/PROD/fs1/EBSapps/comn/adopclone_app7//jlib/oui//jlib/classes12.jar
      copying /u01/apps/PROD/fs1/EBSapps/comn/adopclone_app7//jlib/oui//jlib/swingaccess.jar
      copying /u01/apps/PROD/fs1/EBSapps/comn/adopclone_app7//jlib/oui//jlib/jewt4-nls.jar
      copying /u01/apps/PROD/fs1/EBSapps/comn/adopclone_app7//jlib/oui//jlib/ewt3-swingaccess.jar
      copying /u01/apps/PROD/fs1/EBSapps/comn/adopclone_app7//jlib/oui//jlib/xmlparserv2.jar
      Copy OUI from /u01/apps/PROD/fs1/EBSapps/10.1.2/oui/lib to /u01/apps/PROD/fs1/EBSapps/comn/adopclone_app7//oui/
      Creating FMW staging directories
      Creating log directory
      Creating OHS instance archive stage directory
      Creating Weblogic domain archive stage directory
      Creating t2pjdk directory
      Creating prereq/webtier directory
      Attempting to delete: /u01/apps/PROD/fs1/EBSapps/comn/adopclone_app7//prereq
      Copying /u01/apps/PROD/fs1/FMW_Home/webtier/oui to /u01/apps/PROD/fs1/EBSapps/comn/adopclone_app7//prereq/webtier
      Copying /u01/apps/PROD/fs1/FMW_Home/webtier/inventory/Scripts to /u01/apps/PROD/fs1/EBSapps/comn/adopclone_app7//prereq/webtier

      START: Creating FMW archive.
      Running /u01/apps/PROD/fs1/FMW_Home/oracle_common/bin/copyBinary.sh -javaHome /u01/apps/PROD/fs1/EBSapps/comn/adopclone_app7/FMW/t2pjdk -al /u01/apps/PROD/fs1/EBSapps/comn/adopcl
      one_app7/FMW/FMW_Home.jar -smw /u01/apps/PROD/fs1/FMW_Home -ldl /u01/apps/PROD/fs1/inst/apps/PROD_app7/admin/log/clone/fmwT2PStage -invPtrLoc /etc/oraInst.loc -silent true -debug
      true
      RC-50208: Exception  in method TimedProcessProcess.run
      Raised by oracle.apps.ad.util.TimedProcess$TimedProcessProcess: java.io.IOException: Cannot run program "/u01/apps/PROD/fs1/FMW_Home/oracle_common/bin/copyBinary.sh": error=13, P
      ermission denied
      Script Executed in 101 milliseconds, returning status -1
      ERROR: Script timed out.
      [applprod@app7 ~]$

       

      ============================================================================================

      [applprod@app7 ~]$ more /u01/apps/PROD/fs_ne/EBSapps/log/adop/3/20170329_210613/fs_clone/app7/txkCloneAcquirePort.log
      Script Name    : txkCloneAcquirePort.pl
      Started        : Wed Mar 29 21:08:15 BDT 2017

      Attempting to open socket on port 5557

      Attempting to open socket on port 7002

      Attempting to open socket on port 7602

      Attempting to open socket on port 7402

      Attempting to open socket on port 7202

      Attempting to open socket on port 7802

      Attempting to open socket on port 6101

      Attempting to open socket on port 6201

      Attempting to open socket on port 10000

      Waiting for all child to complete

      PID listening port 5557 is 67003

      PID listening port 7002 is 67004

      PID listening port 7602 is 67006

      PID listening port 7402 is 67012

      PID listening port 7202 is 67013

      PID listening port 7802 is 67058

      PID listening port 6101 is 67060

      PID listening port 6201 is 67061

      PID listening port 10000 is 67062

      Completed      : Wed Mar 29 21:09:05 BDT 2017

      Script Name    : txkCloneAcquirePort.pl
      Started        : Wed Mar 29 21:10:17 BDT 2017

      Attempting to close socket on port 5557

      Attempting to close socket on port 7002

      Attempting to close socket on port 7602

      Attempting to close socket on port 7402

      Attempting to close socket on port 7202

      Attempting to close socket on port 7802

      Attempting to close socket on port 6101

      Attempting to close socket on port 6201

      Attempting to close socket on port 10000

      Terminating PID 67003

      Terminating PID 67004

      Terminating PID 67006

      Terminating PID 67012

      Terminating PID 67013

      Terminating PID 67058

      Terminating PID 67060

      Terminating PID 67061

      Terminating PID 67062

      Completed      : Wed Mar 29 21:10:17 BDT 2017

      [applprod@app7 ~]$

      ======================================================

      [applprod@app7 ~]$ more /u01/apps/PROD/fs2/inst/apps/PROD_app7/logs/appl/admin/log/adadminsrvctl.txt

      03/28/17-06:27:47 :: adadminsrvctl.sh version 120.10.12020000.2.
      .
      JAVA Memory arguments: -Xms256m -Xmx512m  -XX:MaxPermSize=512m
      .
      WLS Start Mode=Production
      .
      CLASSPATH=/u01/apps/PROD/fs2/FMW_Home/oracle_common/modules/oracle.jdbc_11.1.1/ojdbc6dms.jar:/u01/apps/PROD/fs2/FMW_Home/patch_wls1036/profiles/default/sys_manifest_classpath/web
      logic_patch.jar:/u01/apps/PROD/fs2/EBSapps/comn/util/jdk64/lib/tools.jar:/u01/apps/PROD/fs2/FMW_Home/wlserver_10.3/server/lib/weblogic_sp.jar:/u01/apps/PROD/fs2/FMW_Home/wlserver
      _10.3/server/lib/weblogic.jar:/u01/apps/PROD/fs2/FMW_Home/modules/features/weblogic.server.modules_10.3.6.0.jar:/u01/apps/PROD/fs2/FMW_Home/wlserver_10.3/server/lib/webservices.j
      ar:/u01/apps/PROD/fs2/FMW_Home/modules/org.apache.ant_1.7.1/lib/ant-all.jar:/u01/apps/PROD/fs2/FMW_Home/modules/net.sf.antcontrib_1.1.0.0_1-0b2/lib/ant-contrib.jar:/u01/apps/PROD
      /fs2/FMW_Home/oracle_common/soa/modules/commons-cli-1.1.jar:/u01/apps/PROD/fs2/FMW_Home/oracle_common/soa/modules/oracle.soa.mgmt_11.1.1/soa-infra-mgmt.jar:/u01/apps/PROD/fs2/FMW
      _Home/oracle_common/webcenter/modules/oracle.portlet.server_11.1.1/oracle-portlet-api.jar:/u01/apps/PROD/fs2/FMW_Home/oracle_common/modules/oracle.jrf_11.1.1/jrf.jar:/u01/apps/PR
      OD/fs2/EBSapps/comn/java/classes/oracle/apps/fnd/jar/xdoprotocolwrapper.jar:/u01/apps/PROD/fs2/FMW_Home/wlserver_10.3/common/derby/lib/derbyclient.jar:/u01/apps/PROD/fs2/FMW_Home
      /wlserver_10.3/server/lib/xqrl.jar:/u01/apps/PROD/fs2/EBSapps/comn/util/jdk32/lib/dt.jar:/u01/apps/PROD/fs2/EBSapps/comn/util/jdk32/lib/tools.jar:/u01/apps/PROD/fs2/EBSapps/comn/
      util/jdk32/jre/lib/rt.jar:/u01/apps/PROD/fs2/EBSapps/comn/shared-libs/ebs-3rdparty/WEB-INF/lib/ebs3rdpartyManifest.jar:/u01/apps/PROD/fs2/FMW_Home/Oracle_EBS-app1/shared-libs/ebs
      -fmw/WEB-INF/lib/ebsFMWManifest.jar:/u01/apps/PROD/fs2/FMW_Home/Oracle_EBS-app1/shared-libs/ebs-appsborg/WEB-INF/lib/ebsAppsborgManifest.jar:/u01/apps/PROD/fs2/FMW_Home/oracle_co
      mmon/modules/oracle.uix_11.1.1/uix2.jar:/u01/apps/PROD/fs2/EBSapps/comn/java/classes:/u01/apps/PROD/fs2/EBSapps/10.1.2/forms/java:/u01/apps/PROD/fs2/EBSapps/10.1.2/forms/java/frm
      all.jar:/u01/apps/PROD/fs2/EBSapps/10.1.2/jlib/ewt3.jar:/u01/apps/PROD/fs2/EBSapps/10.1.2/j2ee/OC4J_BI_Forms/applications/formsapp/formsweb/WEB-INF/lib/frmsrv.jar
      .
      PATH=/u01/apps/PROD/fs2/FMW_Home/wlserver_10.3/server/bin:/u01/apps/PROD/fs2/FMW_Home/modules/org.apache.ant_1.7.1/bin:/u01/apps/PROD/fs2/EBSapps/comn/util/jdk64/jre/bin:/u01/app
      s/PROD/fs2/EBSapps/comn/util/jdk64/bin:/u01/apps/PROD/fs_ne/EBSapps/appl/ad/bin:/u01/apps/PROD/fs2/FMW_Home/modules/org.apache.ant_1.7.1/bin:/u01/apps/PROD/fs2/inst/apps/PROD_app
      7/admin/scripts:/u01/apps/PROD/fs2/FMW_Home/webtier/perl/bin:/u01/apps/PROD/fs2/EBSapps/10.1.2/bin:/u01/apps/PROD/fs2/EBSapps/appl/fnd/12.0.0/bin:/u01/apps/PROD/fs2/EBSapps/appl/
      ad/12.0.0/bin:/u01/apps/PROD/fs2/EBSapps/comn/util/jdk32/jre/bin:/u01/apps/PROD/fs2/EBSapps/comn/util/jdk32/bin::/u01/apps/PROD/fs2/EBSapps/10.1.2/OPatch:/u01/apps/PROD/fs2/EBSap
      ps/10.1.2/bin:/usr/bin:/usr/sbin:/u01/apps/PROD/fs2/EBSapps/comn/util/jdk32/jre/bin:/u01/apps/PROD/fs2/FMW_Home/wlserver_10.3/server/bin:/u01/apps/PROD/fs2/FMW_Home/modules/org.a
      pache.ant_1.7.1/bin:/u01/apps/PROD/fs2/EBSapps/comn/util/jdk64/jre/bin:/u01/apps/PROD/fs2/EBSapps/comn/util/jdk64/bin:/u01/apps/PROD/fs_ne/EBSapps/appl/ad/bin:/u01/apps/PROD/fs2/
      FMW_Home/modules/org.apache.ant_1.7.1/bin:/u01/apps/PROD/fs2/inst/apps/PROD_app7/admin/scripts:/u01/apps/PROD/fs2/FMW_Home/webtier/perl/bin:/bin:/u01/apps/PROD/fs2/EBSapps/comn/u
      til/jdk32/jre/bin:/u01/apps/PROD/fs2/EBSapps/comn/util/jdk32/bin:/usr/bin:/u02/Oracle_EBS_Financials_12_2_6_0/startCD/Disk1/rapidwiz/unzip/Linux_x64:/usr/bin:/usr/lib64/qt-3.3/bi
      n:/usr/kerberos/sbin:/usr/kerberos/bin:/usr/local/sbin:/usr/local/bin:/sbin:/bin:/usr/sbin:/usr/bin:/root/bin:/u02/Oracle_EBS_Financials_12_2_6_0/startCD/Disk1/rapidwiz/unzip/Lin
      ux_x64
      .
      ***************************************************
      *  To start WebLogic Server, use a username and   *
      *  password assigned to an admin-level user.  For *
      *  server administration, use the WebLogic Server *
      *  console at http://hostname:port/console        *
      ***************************************************
      starting weblogic with Java version:
      java version "1.7.0_85"
      Java(TM) SE Runtime Environment (build 1.7.0_85-b15)
      Java HotSpot(TM) 64-Bit Server VM (build 24.85-b06, mixed mode)
      Starting WLS with line:
      /u01/apps/PROD/fs2/EBSapps/comn/util/jdk64/bin/java -server   -Xms256m -Xmx512m  -XX:MaxPermSize=512m -Dweblogic.Name=AdminServer -Djava.security.policy=/u01/apps/PROD/fs2/FMW_Ho
      me/wlserver_10.3/server/lib/weblogic.policy  -Dweblogic.ProductionModeEnabled=true  -Xverify:none -DCLIENT_PROCESSID=135719   -da -Dplatform.home=/u01/apps/PROD/fs2/FMW_Home/wlse
      rver_10.3 -Dwls.home=/u01/apps/PROD/fs2/FMW_Home/wlserver_10.3/server -Dweblogic.home=/u01/apps/PROD/fs2/FMW_Home/wlserver_10.3/server  -Dcommon.components.home=/u01/apps/PROD/fs
      2/FMW_Home/oracle_common -Djrf.version=11.1.1 -Dorg.apache.commons.logging.Log=org.apache.commons.logging.impl.Jdk14Logger -Ddomain.home=/u01/apps/PROD/fs2/FMW_Home/user_projects
      /domains/EBS_domain_PROD -Djrockit.optfile=/u01/apps/PROD/fs2/FMW_Home/oracle_common/modules/oracle.jrf_11.1.1/jrocket_optfile.txt -Doracle.server.config.dir=/u01/apps/PROD/fs2/F
      MW_Home/user_projects/domains/EBS_domain_PROD/config/fmwconfig/servers/AdminServer -Doracle.domain.config.dir=/u01/apps/PROD/fs2/FMW_Home/user_projects/domains/EBS_domain_PROD/co
      nfig/fmwconfig  -Digf.arisidbeans.carmlloc=/u01/apps/PROD/fs2/FMW_Home/user_projects/domains/EBS_domain_PROD/config/fmwconfig/carml  -Digf.arisidstack.home=/u01/apps/PROD/fs2/FMW
      _Home/user_projects/domains/EBS_domain_PROD/config/fmwconfig/arisidprovider -Doracle.security.jps.config=/u01/apps/PROD/fs2/FMW_Home/user_projects/domains/EBS_domain_PROD/config/
      fmwconfig/jps-config.xml -Doracle.deployed.app.dir=/u01/apps/PROD/fs2/FMW_Home/user_projects/domains/EBS_domain_PROD/servers/AdminServer/tmp/_WL_user -Doracle.deployed.app.ext=/-
      -Dweblogic.alternateTypesDirectory=/u01/apps/PROD/fs2/FMW_Home/oracle_common/modules/oracle.ossoiap_11.1.1,/u01/apps/PROD/fs2/FMW_Home/oracle_common/modules/oracle.oamprovider_1
      1.1.1,/u01/apps/PROD/fs2/FMW_Home/oracle_common/modules/oracle.jps_11.1.1 -Djava.protocol.handler.pkgs=oracle.mds.net.protocol  -Dweblogic.jdbc.remoteEnabled=false -Dportlet.orac
      le.home=/u01/apps/PROD/fs2/FMW_Home/oracle_common  -Dem.oracle.home=/u01/apps/PROD/fs2/FMW_Home/oracle_common -Djava.awt.headless=true -Dweblogic.management.discover=true  -Dwlw.
      iterativeDev=false -Dwlw.testConsole=false -Dwlw.logErrorsToConsole=false -Dweblogic.ext.dirs=/u01/apps/PROD/fs2/FMW_Home/patch_wls1036/profiles/default/sysext_manifest_classpath
        weblogic.Server
      <Mar 28, 2017 6:27:47 AM BDT> <Info> <Security> <BEA-090905> <Disabling CryptoJ JCE Provider self-integrity check for better startup performance. To enable this check, specify -D
      weblogic.security.allowCryptoJDefaultJCEVerification=true>
      <Mar 28, 2017 6:27:47 AM BDT> <Info> <Security> <BEA-090906> <Changing the default Random Number Generator in RSA CryptoJ from ECDRBG to FIPS186PRNG. To disable this change, spec
      ify -Dweblogic.security.allowCryptoJDefaultPRNG=true>
      <Mar 28, 2017 6:27:47 AM BDT> <Info> <WebLogicServer> <BEA-000377> <Starting WebLogic Server with Java HotSpot(TM) 64-Bit Server VM Version 24.85-b06 from Oracle Corporation>
      <Mar 28, 2017 6:27:48 AM BDT> <Info> <Management> <BEA-141107> <Version: WebLogic Server Temporary Patch for BUG13964737 Fri Dec 20 11:32:08 IST 2013
      WebLogic Server Temporary Patch for BUG13729611 Thu Dec 26 16:16:39 MST 2013
      WebLogic Server Temporary Patch for BUG11781879 Fri May 23 11:04:19 IST 2014
      WebLogic Server Temporary Patch for BUG19687084 Fri Apr 03 13:10:28 IST 2015
      WebLogic Server Temporary Patch for BUG20474010 Sun Mar 01 17:22:18 IST 2015
      WebLogic Server Temporary Patch for BUG17319481 Fri Mar 06 15:52:53 IST 2015
      WebLogic Server Temporary Patch for BUG13337000 Mon Dec 15 12:26:08 IST 2014
      WebLogic Server 10.3.6.0.7 PSU Patch for BUG17572726 Wed Nov 20 09:54:42 IST 2013
      WebLogic Server Temporary Patch for BUG17495356 Tue Sep 24 00:23:38 CDT 2013
      WebLogic Server Temporary Patch for BUG17495356 Tue Sep 24 00:23:38 CDT 2013
      WebLogic Server Temporary Patch for BUG17495356 Tue Sep 24 00:23:38 CDT 2013
      WebLogic Server Temporary Patch for BUG17495356 Tue Sep 24 00:23:38 CDT 2013
      WebLogic Server Temporary Patch for BUG17495356 Tue Sep 24 00:23:38 CDT 2013
      WebLogic Server Temporary Patch for ${CRS} Mon Jul 30 16:45:20 EDT 2012
      WebLogic Server Temporary Patch for ${CRS} Mon Jul 30 16:45:20 EDT 2012
      WebLogic Server Temporary Patch for BUG13845626 Tue Mar 20 17:35:12 IST 2012
      WebLogic Server 10.3.6.0  Tue Nov 15 08:52:36 PST 2011 1441050 >
      <Mar 28, 2017 6:27:49 AM BDT> <Notice> <WebLogicServer> <BEA-000365> <Server state changed to STARTING>
      <Mar 28, 2017 6:27:49 AM BDT> <Info> <WorkManager> <BEA-002900> <Initializing self-tuning thread pool>
      <Mar 28, 2017 6:27:49 AM BDT> <Notice> <Log Management> <BEA-170019> <The server log file /u01/apps/PROD/fs2/FMW_Home/user_projects/domains/EBS_domain_PROD/servers/AdminServer/lo
      gs/AdminServer.log is opened. All server side log events will be written to this file.>
      Java HotSpot(TM) 64-Bit Server VM warning: You have loaded library /u01/apps/PROD/fs2/FMW_Home/wlserver_10.3/server/native/linux/i686/libwlfileio3.so which might have disabled st
      ack guard. The VM will try to fix the stack guard now.
      It's highly recommended that you fix the library with 'execstack -c <libfile>', or link it with '-z noexecstack'.
      <Mar 28, 2017 6:27:49 AM BDT> <Error> <Socket> <BEA-000438> <Unable to load performance pack. Using Java I/O instead. Please ensure that libmuxer library is in :'/u01/apps/PROD/f
      s2/FMW_Home/patch_wls1036/profiles/default/native:/u01/apps/PROD/fs2/EBSapps/10.1.2/jdk/jre/lib/i386:/u01/apps/PROD/fs2/EBSapps/10.1.2/jdk/jre/lib/i386/server:/u01/apps/PROD/fs2/
      EBSapps/10.1.2/jdk/jre/lib/i386/native_threads:/u01/apps/PROD/fs2/EBSapps/appl/cz/12.0.0/bin:/u01/apps/PROD/fs2/EBSapps/10.1.2/lib32:/u01/apps/PROD/fs2/EBSapps/10.1.2/lib:/usr/X1
      1R6/lib:/usr/openwin/lib:/u01/apps/PROD/fs2/EBSapps/10.1.2/jdk/jre/lib/i386:/u01/apps/PROD/fs2/EBSapps/10.1.2/jdk/jre/lib/i386/server:/u01/apps/PROD/fs2/EBSapps/10.1.2/jdk/jre/li
      b/i386/native_threads:/u01/apps/PROD/fs2/EBSapps/appl/sht/12.0.0/lib:/u01/apps/PROD/fs2/FMW_Home/wlserver_10.3/server/native/linux/i686:/u01/apps/PROD/fs2/FMW_Home/wlserver_10.3/
      server/native/linux/i686/oci920_8:/u01/apps/PROD/fs2/EBSapps/10.1.2/lib:/u01/apps/PROD/fs2/EBSapps/10.1.2/lib32::/u01/apps/PROD/fs2/FMW_Home/webtier/lib:/u01/apps/PROD/fs2/EBSapp
      s/appl/cz/12.0.0/bin64:/u01/apps/PROD/fs2/EBSapps/appl/iby/12.0.0/bin:/u01/apps/PROD/fs2/EBSapps/appl/pon/12.0.0/bin:/u01/apps/PROD/fs2/EBSapps/appl/sht/12.0.0/lib:/usr/java/pack
      ages/lib/amd64:/usr/lib64:/lib64:/lib:/usr/lib'
      >
      Mar 28, 2017 6:29:24 AM oracle.security.jps.internal.idstore.util.LibOvdUtil pushLdapNamesToLibOvd
      INFO: Pushed ldap name and types info to libOvd. Ldaps : DefaultAuthenticator:idstore.ldap.provideridstore.ldap.
      <Mar 28, 2017 6:29:25 AM BDT> <Notice> <Security> <BEA-090082> <Security initializing using security realm myrealm.>
      <Mar 28, 2017 6:29:25 AM BDT> <Warning> <Store> <BEA-280109> <Unable to load the native wlfileio library for the persistent file store "_WLS_AdminServer". The store will use buff
      ered I/O. The store is still operating in a transactionally safe synchronous mode. See store open log messages for the requested and final write policies.>
      Mar 28, 2017 6:29:26 AM oracle.security.jps.JpsStartup start
      INFO: Jps initializing.
      Mar 28, 2017 6:29:26 AM oracle.security.jps.JpsStartup start
      INFO: Jps started.
      Mar 28, 2017 6:29:26 AM oracle.as.jmx.framework.generic.spi.BaseJMXFrameworkProviderImpl getConfigObjectMBeanAssociationInfo
      WARNING: The configuration at URI "/u01/apps/PROD/fs2/FMW_Home/user_projects/domains/EBS_domain_PROD/config/fmwconfig/mbeans/../default-keystore.jks" cannot be loaded.
      <Mar 28, 2017 6:29:28 AM BDT> <Notice> <WebLogicServer> <BEA-000365> <Server state changed to STANDBY>
      <Mar 28, 2017 6:29:28 AM BDT> <Notice> <WebLogicServer> <BEA-000365> <Server state changed to STARTING>
      <Mar 28, 2017 6:29:28 AM BDT> <Warning> <oracle.as.jmx.framework.generic.spi.BaseJMXFrameworkProviderImpl> <BEA-000000> <The configuration at URI "/u01/apps/PROD/fs2/FMW_Home/use
      r_projects/domains/EBS_domain_PROD/config/fmwconfig/mbeans/../default-keystore.jks" cannot be loaded.>
      <Mar 28, 2017 6:29:36 AM BDT> <Warning> <Security> <BEA-090668> <Ignored deployment of role "Admin" for resource "type=<url>, application=DMS Application#11.1.1.1.0, contextPath=
      /dms, uri=/">
      <Mar 28, 2017 6:29:36 AM BDT> <Warning> <J2EE> <BEA-160195> <The application version lifecycle event listener oracle.security.jps.wls.listeners.JpsAppVersionLifecycleListener is
      ignored because the application em is not versioned.>
      <Mar 28, 2017 6:29:40 AM BDT> <Warning> <J2EE> <BEA-160140> <Unresolved optional package references (in META-INF/MANIFEST.MF): [Extension-Name: oracle.rules, referenced from: /u0
      1/apps/PROD/fs2/FMW_Home/user_projects/domains/EBS_domain_PROD/servers/AdminServer/tmp/_WL_user/emai/xalnv4]. Make sure the referenced optional package has been deployed as a lib
      rary.>
      <Mar 28, 2017 6:29:41 AM BDT> <Error> <org.apache.beehive.netui.pageflow.internal.AdapterManager> <BEA-000000> <ServletContainerAdapter manager not initialized correctly.>
      <Mar 28, 2017 6:29:42 AM BDT> <Warning> <oracle.dms.collector> <DMS-50911> <Duplicated metric table. Metric table oracle_oam:token_requests will be ignored.>
      <Mar 28, 2017 6:29:42 AM BDT> <Warning> <oracle.dms.collector> <DMS-50911> <Duplicated metric table. Metric table oracle_oam:core_token_generation will be ignored.>
      <Mar 28, 2017 6:29:42 AM BDT> <Warning> <oracle.dms.collector> <DMS-50911> <Duplicated metric table. Metric table oracle_oam:core_token_validation will be ignored.>
      <Mar 28, 2017 6:29:42 AM BDT> <Warning> <oracle.dms.collector> <DMS-50911> <Duplicated metric table. Metric table oracle_oam:partner_requests will be ignored.>
      <Mar 28, 2017 6:29:42 AM BDT> <Warning> <oracle.dms.collector> <DMS-50911> <Duplicated metric table. Metric table domain_oracle_oam:token_request_rollup will be ignored.>
      <Mar 28, 2017 6:29:42 AM BDT> <Warning> <oracle.dms.collector> <DMS-50911> <Duplicated metric table. Metric table domain_oracle_oam:token_request_rollup_rate will be ignored.>
      <Mar 28, 2017 6:29:42 AM BDT> <Warning> <oracle.dms.collector> <DMS-50911> <Duplicated metric table. Metric table domain_oracle_oam:core_token_generation_rollup will be ignored.>

      <Mar 28, 2017 6:29:42 AM BDT> <Warning> <oracle.dms.collector> <DMS-50911> <Duplicated metric table. Metric table domain_oracle_oam:core_token_generation_rollup_rate will be igno
      red.>
      <Mar 28, 2017 6:29:42 AM BDT> <Warning> <oracle.dms.collector> <DMS-50911> <Duplicated metric table. Metric table domain_oracle_oam:core_token_validation_rollup will be ignored.>

      <Mar 28, 2017 6:29:42 AM BDT> <Warning> <oracle.dms.collector> <DMS-50911> <Duplicated metric table. Metric table domain_oracle_oam:core_token_validation_rollup_rate will be igno
      red.>
      <Mar 28, 2017 6:29:42 AM BDT> <Warning> <oracle.dms.collector> <DMS-50911> <Duplicated metric table. Metric table domain_oracle_oam:partner_request_rollup will be ignored.>
      <Mar 28, 2017 6:29:42 AM BDT> <Warning> <oracle.dms.collector> <DMS-50911> <Duplicated metric table. Metric table domain_oracle_oam:partner_request_rollup_rate will be ignored.>
      PostInstallConfigIntegration:oracle_ias_farm target auth registration is done.
      PostInstallConfigIntegration:websphere_cell target auth registration is done.
      <Mar 28, 2017 6:29:46 AM BDT> <Warning> <oracle.mds> <BEA-000000> <MDS-11019: The default CharSet US-ASCII is not a unicode character set. File names with non-ASCII characters ma
      y not operate as expected. Check locale settings.>
      <Mar 28, 2017 6:29:49 AM BDT> <Error> <HTTP> <BEA-101165> <Could not load user defined filter in web.xml: org.apache.myfaces.trinidad.webapp.TrinidadFilter.
      java.lang.NoClassDefFoundError: oracle/binding/DataControl
              at java.lang.ClassLoader.defineClass1(Native Method)
              at java.lang.ClassLoader.defineClass(ClassLoader.java:800)
              at java.security.SecureClassLoader.defineClass(SecureClassLoader.java:142)
              at java.net.URLClassLoader.defineClass(URLClassLoader.java:449)
              at java.net.URLClassLoader.access$100(URLClassLoader.java:71)
              Truncated. see log file for complete stacktrace
      Caused By: java.lang.ClassNotFoundException: oracle.binding.DataControl
              at java.net.URLClassLoader$1.run(URLClassLoader.java:366)
              at java.net.URLClassLoader$1.run(URLClassLoader.java:355)
              at java.security.AccessController.doPrivileged(Native Method)
              at java.net.URLClassLoader.findClass(URLClassLoader.java:354)
              at java.lang.ClassLoader.loadClass(ClassLoader.java:425)
              Truncated. see log file for complete stacktrace
      >
      <Mar 28, 2017 6:29:49 AM BDT> <Error> <HTTP> <BEA-101165> <Could not load user defined filter in web.xml: oracle.adf.view.rich.webapp.AdfFacesFilter.
      java.lang.NoClassDefFoundError: oracle/binding/DataControl
              at java.lang.ClassLoader.defineClass1(Native Method)
              at java.lang.ClassLoader.defineClass(ClassLoader.java:800)
              at java.security.SecureClassLoader.defineClass(SecureClassLoader.java:142)
              at java.net.URLClassLoader.defineClass(URLClassLoader.java:449)
              at java.net.URLClassLoader.access$100(URLClassLoader.java:71)
              Truncated. see log file for complete stacktrace
      Caused By: java.lang.ClassNotFoundException: oracle.binding.DataControl
              at java.net.URLClassLoader$1.run(URLClassLoader.java:366)
              at java.net.URLClassLoader$1.run(URLClassLoader.java:355)
              at java.security.AccessController.doPrivileged(Native Method)
              at java.net.URLClassLoader.findClass(URLClassLoader.java:354)
              at java.lang.ClassLoader.loadClass(ClassLoader.java:425)
              Truncated. see log file for complete stacktrace
      >
      <Mar 28, 2017 6:29:54 AM BDT> <Notice> <Log Management> <BEA-170027> <The Server has established connection with the Domain level Diagnostic Service successfully.>
      <Mar 28, 2017 6:29:54 AM BDT> <Notice> <WebLogicServer> <BEA-000365> <Server state changed to ADMIN>
      <Mar 28, 2017 6:29:54 AM BDT> <Notice> <WebLogicServer> <BEA-000365> <Server state changed to RESUMING>
      <Mar 28, 2017 6:29:54 AM BDT> <Notice> <Server> <BEA-002613> <Channel "Default" is now listening on 192.168.55.215:7002 for protocols iiop, t3, ldap, snmp, http.>
      <Mar 28, 2017 6:29:54 AM BDT> <Notice> <WebLogicServer> <BEA-000329> <Started WebLogic Admin Server "AdminServer" for domain "EBS_domain_PROD" running in Production Mode>
      <Mar 28, 2017 6:29:54 AM BDT> <Notice> <WebLogicServer> <BEA-000365> <Server state changed to RUNNING>
      <Mar 28, 2017 6:29:54 AM BDT> <Notice> <WebLogicServer> <BEA-000360> <Server started in RUNNING mode>

      03/28/17-06:30:47 :: adadminsrvctl.sh: exiting with status 0

      ================================================================================

      <Mar 28, 2017 6:34:50 AM BDT> <Warning> <Management> <BEA-141239> <The non-dynamic attribute HostnameVerifier on weblogic.management.configuration.SSLMBeanImpl@65a577eb([EBS_doma
      in_PROD]/Servers[oacore_server1]/SSL[oacore_server1]) has been changed. This may require redeploying or rebooting configured entities>
      <Mar 28, 2017 6:35:49 AM BDT> <Warning> <Socket> <BEA-000402> <There are: 5 active sockets, but the maximum number of socket reader threads allowed by the configuration is: 4. Yo
      u may want to alter your configuration.>
      <Mar 28, 2017 6:40:00 AM BDT> <Alert> <WebLogicServer> <BEA-000396> <Server shutdown has been requested by weblogic>
      <Mar 28, 2017 6:40:00 AM BDT> <Notice> <WebLogicServer> <BEA-000365> <Server state changed to SUSPENDING>
      <Mar 28, 2017 6:40:00 AM BDT> <Notice> <WebLogicServer> <BEA-000365> <Server state changed to ADMIN>
      <Mar 28, 2017 6:40:00 AM BDT> <Notice> <WebLogicServer> <BEA-000365> <Server state changed to SHUTTING_DOWN>
      <Mar 28, 2017 6:40:00 AM BDT> <Notice> <Server> <BEA-002607> <Channel "Default" listening on 192.168.55.215:7002 was shutdown.>
      <Mar 28, 2017 6:40:01 AM BDT> <Warning> <Management> <BEA-141269> <The temporary bean tree updateDeploymentContext(Tue Mar 28 06:35:29 BDT 2017) was allocated for an undo, get, o
      r activate operation, but has not been garbage collected.>
      <Mar 28, 2017 6:40:01 AM BDT> <Warning> <Management> <BEA-141269> <The temporary bean tree updateDeploymentContext(Tue Mar 28 06:34:48 BDT 2017) was allocated for an undo, get, o
      r activate operation, but has not been garbage collected.>

      03/28/17-06:40:04 :: adadminsrvctl.sh version 120.10.12020000.2
      Validated the passed arguments for the option ebs-get-serverstatus
      AdminServer is currently not running.

      Validated the passed arguments for the option ebs-nmstart-adminsrv
      Checking if the Admin Server is already up.
      The Admin Server is not already up.
      Connecting to Node Manager ...
      Successfully Connected to Node Manager.

      Connected to the Node Manager.

      Starting server AdminServer ...
      Successfully started server AdminServer ...

       

      03/28/17-06:40:43 :: adadminsrvctl.sh: exiting with status 0

      ================================================================================

      stty: standard input: Invalid argument
      Enter the APPS user password:
      stty: standard input: Invalid argument
      stty: standard input: Invalid argument
      Enter the WebLogic AdminServer password:
      stty: standard input: Invalid argument
      The log file is /u01/apps/PROD/fs2/inst/apps/PROD_app7/logs/appl/rgf/Tue_Mar_28_06_40_43_2017/adRegisterWLSListeners.log

      03/28/17-08:24:44 :: adadminsrvctl.sh version 120.10.12020000.2
      Validated the passed arguments for the option ebs-get-serverstatus
      AdminServer is in RUNNING mode.

      Validated the passed arguments for the option ebs-nmstop-adminsrv
      Connecting to t3://app7.luminataerp.com:7002 with userid weblogic ...
      Successfully connected to Admin Server 'AdminServer' that belongs to domain 'EBS_domain_PROD'.

      Warning: An insecure protocol was used to connect to the
      server. To ensure on-the-wire security, the SSL port or
      Admin port should be used instead.

       

      Shutting down the server AdminServer with force=true while connected to AdminServer ...
      WLST lost connection to the WebLogic Server that you were
      connected to, this may happen if the server was shutdown or
      partitioned. You will have to re-connect to the server once the
      server is available.
      Disconnected from weblogic server: AdminServer
      Disconnected from weblogic server:

       

      03/28/17-08:24:53 :: adadminsrvctl.sh: exiting with status 0

      ================================================================================

      03/29/17-17:27:20 :: adadminsrvctl.sh version 120.10.12020000.2
      Validated the passed arguments for the option ebs-get-serverstatus
      AdminServer is currently not running.

      03/29/17-17:27:25 :: adadminsrvctl.sh: exiting with status 2

      ================================================================================

      03/29/17-20:00:57 :: adadminsrvctl.sh version 120.10.12020000.2
      Validated the passed arguments for the option ebs-get-serverstatus
      AdminServer is currently not running.

      03/29/17-20:01:02 :: adadminsrvctl.sh: exiting with status 2

      ================================================================================

      03/29/17-21:04:36 :: adadminsrvctl.sh version 120.10.12020000.2
      Validated the passed arguments for the option ebs-get-serverstatus
      AdminServer is currently not running.

      03/29/17-21:04:38 :: adadminsrvctl.sh: exiting with status 2

      ================================================================================

      03/29/17-21:10:17 :: adadminsrvctl.sh version 120.10.12020000.2
      Validated the passed arguments for the option ebs-get-serverstatus
      AdminServer is currently not running.

      03/29/17-21:10:19 :: adadminsrvctl.sh: exiting with status 2

      ================================================================================

      [applprod@app7 ~]$

      ===================================================================================================================

      [applprod@app7 ~]$ more /u01/apps/PROD/fs2/inst/apps/PROD_app7/logs/appl/admin/log/adnodemgrctl.txt

      03/28/17-08:24:53 :: adnodemgrctl.sh version 120.11.12020000.4
      Validated the passed arguments for the option ebs-get-nmstatus
      Connecting to Node Manager ...
      Successfully Connected to Node Manager.

      The Node Manager is up.

      Validated the passed arguments for the option ebs-stop-nm
      Checking if the Node Manager is already up..
      Connecting to Node Manager ...
      Successfully Connected to Node Manager.

      Already connected to a Node Manager

      The Node Manager is up.
      Stopping the Node Manager...
      Stopped NodeManager successfully

      Stopped the Node Manager..

      03/28/17-08:24:59 :: adnodemgrctl.sh: exiting with status 0

      ================================================================================

      03/29/17-17:27:26 :: adnodemgrctl.sh version 120.11.12020000.4
      Validated the passed arguments for the option ebs-get-nmstatus
      Traceback (innermost last):
        File "<string>", line 1, in ?
        File "<iostream>", line 123, in nmConnect
        File "<iostream>", line 656, in raiseWLSTException
      WLSTException: Error occured while performing nmConnect : Cannot connect to Node Manager. : Connection refused. Could not connect to NodeManager. Check that it is running at app7
      .luminataerp.com:5557.
      Use dumpStack() to view the full stacktrace

      Connecting to Node Manager ...

      The Node Manager is not up.

      03/29/17-17:27:29 :: adnodemgrctl.sh: exiting with status 2

      ================================================================================

      03/29/17-20:01:03 :: adnodemgrctl.sh version 120.11.12020000.4
      Validated the passed arguments for the option ebs-get-nmstatus
      Traceback (innermost last):
        File "<string>", line 1, in ?
        File "<iostream>", line 123, in nmConnect
        File "<iostream>", line 656, in raiseWLSTException
      WLSTException: Error occured while performing nmConnect : Cannot connect to Node Manager. : Connection refused. Could not connect to NodeManager. Check that it is running at app7
      .luminataerp.com:5557.
      Use dumpStack() to view the full stacktrace

      Connecting to Node Manager ...

      The Node Manager is not up.

      03/29/17-20:01:06 :: adnodemgrctl.sh: exiting with status 2

      ================================================================================

      03/29/17-21:04:38 :: adnodemgrctl.sh version 120.11.12020000.4
      Validated the passed arguments for the option ebs-get-nmstatus
      Traceback (innermost last):
        File "<string>", line 1, in ?
        File "<iostream>", line 123, in nmConnect
        File "<iostream>", line 656, in raiseWLSTException
      WLSTException: Error occured while performing nmConnect : Cannot connect to Node Manager. : Connection refused. Could not connect to NodeManager. Check that it is running at app7
      .luminataerp.com:5557.
      Use dumpStack() to view the full stacktrace

      Connecting to Node Manager ...

      The Node Manager is not up.

      03/29/17-21:04:41 :: adnodemgrctl.sh: exiting with status 2

      ================================================================================

      03/29/17-21:10:20 :: adnodemgrctl.sh version 120.11.12020000.4
      Validated the passed arguments for the option ebs-get-nmstatus
      Traceback (innermost last):
        File "<string>", line 1, in ?
        File "<iostream>", line 123, in nmConnect
        File "<iostream>", line 656, in raiseWLSTException
      WLSTException: Error occured while performing nmConnect : Cannot connect to Node Manager. : Connection refused. Could not connect to NodeManager. Check that it is running at app7
      .luminataerp.com:5557.
      Use dumpStack() to view the full stacktrace

      Connecting to Node Manager ...

      The Node Manager is not up.

      03/29/17-21:10:23 :: adnodemgrctl.sh: exiting with status 2

      ================================================================================

      [applprod@app7 ~]$ 

       

      ===============================================================================================

       

      Please help me out.

       

      Thanks

      Rakib

        • 1. Re: adop phase=fs_clone error on EBS 12.2.6
          #MVivek

          Hi,

           

          Please check the below link -

           

          EBS 12.2 - fs_clone fail [UNEXPECTED]Error 1 occurred while Blocking ports on myhots

           

          Check:

           

          1. The Environment is correct or not ?

          2. Host file ?

          3. Admin Server is patch file system is down or not ?

           

          bash-3.2$ adadminsrvctl.sh stop forcepatchfs    >> Perfom this one first.

          bash-3.2$

           

          Then check any java process is running on the file system or not

          bash-3.2$ ps -ef | grep fs2

          .

          If any java process is running, please kill them..

           

          Thanks

          Vivek

          • 2. Re: adop phase=fs_clone error on EBS 12.2.6
            1042232

            1. The Environment is correct or not ? correct it is run file system

            2. Host file ?

            [applprod@app7 scripts]$ cat /etc/hosts

            127.0.0.1   localhost.localdomain       localhost

            ::1         localhost localhost.localdomain localhost6 localhost6.localdomain6

            192.168.55.215  app7.luminataerp.com    app7

            [applprod@app7 scripts]$

             

             

            3. Admin Server is patch file system is down or not ?

            it is down.

             

            [applprod@app7 scripts]$ adadminsrvctl.sh stop forcepatchfs

            You are running adadminsrvctl.sh version 120.10.12020000.2

            Enter the WebLogic Admin password:
            Enter the APPS Schema password:

            The AdminServer is already shutdown

            adadminsrvctl.sh: exiting with status 2

            adadminsrvctl.sh: check the logfile /u01/apps/PROD/fs2/inst/apps/PROD_app7/logs/appl/admin/log/adadminsrvctl.txt for more information ... 

            [applprod@app7 scripts]$

             

            Thanks

            Rakib

            • 3. Re: adop phase=fs_clone error on EBS 12.2.6
              #MVivek

              ps -ef | grep fs2  Result please

              • 4. Re: adop phase=fs_clone error on EBS 12.2.6
                #MVivek

                Please check hostname is pinging or not ?

                 

                Like,

                 

                ping app7.luminataerp.com

                • 5. Re: adop phase=fs_clone error on EBS 12.2.6
                  1042232

                  [applprod@app7 scripts]$ ps -ef | grep fs2 

                  [applprod@app7 scripts]$

                  • 6. Re: adop phase=fs_clone error on EBS 12.2.6
                    1042232

                    [applprod@app7 scripts]$ ping app7.luminataerp.com

                    PING app7.luminataerp.com (192.168.55.215) 56(84) bytes of data.

                    64 bytes from app7.luminataerp.com (192.168.55.215): icmp_seq=1 ttl=64 time=0.010 ms

                    64 bytes from app7.luminataerp.com (192.168.55.215): icmp_seq=2 ttl=64 time=0.008 ms

                    64 bytes from app7.luminataerp.com (192.168.55.215): icmp_seq=3 ttl=64 time=0.016 ms

                    64 bytes from app7.luminataerp.com (192.168.55.215): icmp_seq=4 ttl=64 time=0.008 ms

                    64 bytes from app7.luminataerp.com (192.168.55.215): icmp_seq=5 ttl=64 time=0.016 ms

                    64 bytes from app7.luminataerp.com (192.168.55.215): icmp_seq=6 ttl=64 time=0.016 ms

                    ^C

                    --- app7.luminataerp.com ping statistics ---

                    6 packets transmitted, 6 received, 0% packet loss, time 5027ms

                    rtt min/avg/max/mdev = 0.008/0.012/0.016/0.004 ms

                    [applprod@app7 scripts]$

                    • 7. Re: adop phase=fs_clone error on EBS 12.2.6
                      #MVivek

                      And re-run the fs_clone abandon=yes

                       

                      Thanks

                      Vivek

                      • 8. Re: adop phase=fs_clone error on EBS 12.2.6
                        1042232

                        no good luck

                         

                        [applprod@app7 scripts]$ adop phase=fs_clone abandon=yes

                        Enter the APPS password:
                        Enter the SYSTEM password:
                        Enter the WLSADMIN password:

                        Validating credentials.

                        Initializing.
                            Run Edition context  : /u01/apps/PROD/fs1/inst/apps/PROD_app7/appl/admin/PROD_app7.xml
                            Patch edition context: /u01/apps/PROD/fs2/inst/apps/PROD_app7/appl/admin/PROD_app7.xml

                        Warning: Ignoring 'abandon' parameter as no failed previous patching cycle was found.

                        Warning: Ignoring 'restart' parameter as no failed previous patching cycle was found.
                            Patch file system free space: 285.99 GB

                        Validating system setup.
                            Node registry is valid.

                        Checking for existing adop sessions.
                            No pending session exists.
                            Starting new adop session.

                        ===========================================================================
                        ADOP (C.Delta.8)
                        Session ID: 3
                        Node: app7
                        Phase: fs_clone
                        Log: /u01/apps/PROD/fs_ne/EBSapps/log/adop/3/20170330_010629/adop.log
                        ===========================================================================

                        Validating configuration on node: [app7].
                            Log: /u01/apps/PROD/fs_ne/EBSapps/log/adop/3/20170330_010629/fs_clone/validate/app7
                                [WARNING]: There could be issues while validating the ports used for E-Business Suite instance against ports used in /etc/services. Refer the log file for more details.

                        Checking for pending cleanup actions.
                            No pending cleanup actions found.

                        Blocking managed server ports.
                            Log: /u01/apps/PROD/fs_ne/EBSapps/log/adop/3/20170330_010629/fs_clone/app7/txkCloneAcquirePort.log

                        Performing CLONE steps.
                            Log: /u01/apps/PROD/fs_ne/EBSapps/log/adop/3/20170330_010629/fs_clone/app7

                         

                        Beginning application tier FSCloneStage - Thu Mar 30 01:09:20 2017

                        /u01/apps/PROD/fs1/EBSapps/comn/util/jdk32/bin/java -Xmx600M -DCONTEXT_VALIDATED=false -Doracle.installer.oui_loc=/oui -classpath /u01/apps/PROD/fs1/FMW_Home/webtier/lib/xmlparserv2.jar:/u01/apps/PROD/fs1/FMW_Home/webtier/jdbc/lib/ojdbc6.jar:/u01/apps/PROD/fs1/EBSapps/comn/java/classes:/u01/apps/PROD/fs1/FMW_Home/webtier/oui/jlib/OraInstaller.jar:/u01/apps/PROD/fs1/FMW_Home/webtier/oui/jlib/ewt3.jar:/u01/apps/PROD/fs1/FMW_Home/webtier/oui/jlib/share.jar:/u01/apps/PROD/fs1/FMW_Home/webtier/../Oracle_EBS-app1/oui/jlib/srvm.jar:/u01/apps/PROD/fs1/FMW_Home/webtier/jlib/ojmisc.jar:/u01/apps/PROD/fs1/FMW_Home/wlserver_10.3/server/lib/weblogic.jar:/u01/apps/PROD/fs1/FMW_Home/oracle_common/jlib/obfuscatepassword.jar  oracle.apps.ad.clone.FSCloneStageAppsTier -e /u01/apps/PROD/fs1/inst/apps/PROD_app7/appl/admin/PROD_app7.xml -targ /u01/apps/PROD/fs2/inst/apps/PROD_app7/appl/admin/PROD_app7.xml -stage /u01/apps/PROD/fs1/EBSapps/comn/adopclone_app7 -tmp /tmp -component appsTier -nopromptmsg
                        Log file located at /u01/apps/PROD/fs1/inst/apps/PROD_app7/admin/log/clone/FSCloneStageAppsTier_03300109.log

                        ERROR while running FSCloneStage...
                        Thu Mar 30 01:10:30 2017
                        *******FATAL ERROR*******
                        PROGRAM : (/u01/apps/PROD/fs1/EBSapps/appl/ad/12.0.0/patch/115/bin/txkADOPPreparePhaseSynchronize.pl)
                        TIME    : Thu Mar 30 01:10:30 2017
                        FUNCTION: main::runFSCloneStage [ Level 1 ]
                        ERRORMSG: /u01/apps/PROD/fs1/EBSapps/appl/ad/12.0.0/bin/adclone.pl did not go through successfully.

                            [UNEXPECTED]Error occurred running "perl /u01/apps/PROD/fs1/EBSapps/appl/ad/12.0.0/patch/115/bin/txkADOPPreparePhaseSynchronize.pl -contextfile=/u01/apps/PROD/fs1/inst/apps/PROD_app7/appl/admin/PROD_app7.xml -patchcontextfile=/u01/apps/PROD/fs2/inst/apps/PROD_app7/appl/admin/PROD_app7.xml -promptmsg=hide -console=off -mode=create -sync_mode=copy -sessionid=3 -timestamp=20170330_010629 -outdir=/u01/apps/PROD/fs_ne/EBSapps/log/adop/3/20170330_010629/fs_clone/app7"
                            [UNEXPECTED]occurred during CLONE Patch File System from Run File System, running command: "perl /u01/apps/PROD/fs1/EBSapps/appl/ad/12.0.0/patch/115/bin/txkADOPPreparePhaseSynchronize.pl -contextfile=/u01/apps/PROD/fs1/inst/apps/PROD_app7/appl/admin/PROD_app7.xml -patchcontextfile=/u01/apps/PROD/fs2/inst/apps/PROD_app7/appl/admin/PROD_app7.xml -promptmsg=hide -console=off -mode=create -sync_mode=copy -sessionid=3 -timestamp=20170330_010629 -outdir=/u01/apps/PROD/fs_ne/EBSapps/log/adop/3/20170330_010629/fs_clone/app7".
                            Releasing managed server ports.
                            Log: /u01/apps/PROD/fs_ne/EBSapps/log/adop/3/20170330_010629/fs_clone/app7/txkCloneAcquirePort.log
                            Stopping services on patch file system.
                            Stopping admin server.

                        You are running adadminsrvctl.sh version 120.10.12020000.2


                        The AdminServer is already shutdown

                        adadminsrvctl.sh: exiting with status 2

                        adadminsrvctl.sh: check the logfile /u01/apps/PROD/fs2/inst/apps/PROD_app7/logs/appl/admin/log/adadminsrvctl.txt for more information ... 

                            Stopping node manager.

                        You are running adnodemgrctl.sh version 120.11.12020000.4


                        Either the Node Manager is not up or the credentials are incorrect.

                        adnodemgrctl.sh: exiting with status 2

                        adnodemgrctl.sh: check the logfile /u01/apps/PROD/fs2/inst/apps/PROD_app7/logs/appl/admin/log/adnodemgrctl.txt for more information ... 

                            [UNEXPECTED]fs_clone has failed.


                        [STATEMENT] Please run adopscanlog utility, using the command

                        "adopscanlog -latest=yes"

                        to get the list of the log files along with snippet of the error message corresponding to each log file.


                        adop exiting with status = 2 (Fail)
                        [applprod@app7 scripts]$

                        • 9. Re: adop phase=fs_clone error on EBS 12.2.6
                          Prashant Umap

                          Hello Rakib,

                          Thanks for the post and detail error log message.

                           

                          While running FS_CLONE, It seems on PATCH instance not able to shutdown the WLS server.

                          1. After patching please run adautocfg on RUN system.

                          2. Can you try to stop manually the process on PATCH instance and run FS_CLONE.

                           

                          Please share the result for more troubleshoot.

                           

                          Regards

                          Prashant Umap

                          • 10. Re: adop phase=fs_clone error on EBS 12.2.6
                            mdtaylor

                            Please review 12.2 E-Business Suite Patching Adop Phase=fs_clone Failing on TxkADOPPreparePhaseSynchronize.pl RC-50204: Error: - ONS Remote Port in Use (Doc ID 2045627.1)

                             

                            Are you sure the patch fs port pool is higher than run fs.  Please execute EBSapps.env patch, then cd to $ADMIN_SCRIPTS_HOME and ensure you can start adadminsrvctl.sh without error.  Then stop it and adnodemgrctl.sh and try the fs_clone again after checking ports with the note above.

                            • 11. Re: adop phase=fs_clone error on EBS 12.2.6
                              1042232

                              Hi   mdtaylor,

                               

                              As per your instruction.

                               

                              ============================

                              [applprod@app7 ~]$ . /u01/apps/PROD/EBSapps.env patch

                                E-Business Suite Environment Information
                                ----------------------------------------
                                RUN File System           : /u01/apps/PROD/fs1/EBSapps/appl
                                PATCH File System         : /u01/apps/PROD/fs2/EBSapps/appl
                                Non-Editioned File System : /u01/apps/PROD/fs_ne


                                DB Host: app7.luminataerp.com  Service/SID: PROD


                                Sourcing the PATCH File System ...

                              [applprod@app7 ~]$
                              [applprod@app7 ~]$
                              [applprod@app7 ~]$ cd $ADMIN_SCRIPTS_HOME
                              [applprod@app7 scripts]$ ./adadminsrvctl.sh start

                              You are running adadminsrvctl.sh version 120.10.12020000.2


                              ERROR:  Services should normally be started from the Run environment, not the Patch environment
                                      To start services from the Patch environment, you must specify the 'forcepatchfs' option.

                              adadminsrvctl.sh: Exiting with status 1[applprod@app7 scripts]$
                              [applprod@app7 scripts]$
                              [applprod@app7 scripts]$
                              [applprod@app7 scripts]$ ./adadminsrvctl.sh start forcepatchfs

                              You are running adadminsrvctl.sh version 120.10.12020000.2

                              Enter the WebLogic Admin password:
                              Enter the APPS Schema password:
                              Starting WLS Admin Server...
                              NMProcess: <Mar 30, 2017 3:27:09 AM> <INFO> <Loading domains file: /u01/apps/PROD/fs2/FMW_Home/wlserver_10.3/common/nodemanager/nmHome1/nodemanager.domains>
                              NMProcess: Mar 30, 2017 3:27:09 AM weblogic.nodemanager.server.NMServerConfig initDomainsMap
                              NMProcess: INFO: Loading domains file: /u01/apps/PROD/fs2/FMW_Home/wlserver_10.3/common/nodemanager/nmHome1/nodemanager.domains
                              NMProcess: <Mar 30, 2017 3:27:09 AM> <INFO> <Loaded node manager configuration properties from '/u01/apps/PROD/fs2/FMW_Home/wlserver_10.3/common/nodemanager/nmHome1/nodemanager.properties'>
                              NMProcess: Mar 30, 2017 3:27:09 AM weblogic.nodemanager.server.NMServer <init>
                              NMProcess: INFO: Loaded node manager configuration properties from '/u01/apps/PROD/fs2/FMW_Home/wlserver_10.3/common/nodemanager/nmHome1/nodemanager.properties'
                              NMProcess: Node manager v10.3
                              NMProcess:
                              NMProcess: Configuration settings:
                              NMProcess:
                              NMProcess: NodeManagerHome=/u01/apps/PROD/fs2/FMW_Home/wlserver_10.3/common/nodemanager/nmHome1
                              NMProcess: ListenAddress=app7.luminataerp.com
                              NMProcess: ListenPort=5557
                              NMProcess: ListenBacklog=50
                              NMProcess: SecureListener=false
                              NMProcess: AuthenticationEnabled=true
                              NMProcess: NativeVersionEnabled=true
                              NMProcess: CrashRecoveryEnabled=false
                              NMProcess: JavaHome=/u01/apps/PROD/fs2/EBSapps/comn/util/jdk64
                              NMProcess: StartScriptEnabled=false
                              NMProcess: StopScriptEnabled=false
                              NMProcess: StartScriptName=startWebLogic.sh
                              NMProcess: StopScriptName=
                              NMProcess: LogFile=/u01/apps/PROD/fs2/FMW_Home/wlserver_10.3/common/nodemanager/nmHome1/nodemanager.log
                              NMProcess: LogLevel=INFO
                              NMProcess: LogLimit=0
                              NMProcess: LogCount=1
                              NMProcess: LogAppend=true
                              NMProcess: LogToStderr=true
                              NMProcess: LogFormatter=weblogic.nodemanager.server.LogFormatter
                              NMProcess: DomainsFile=/u01/apps/PROD/fs2/FMW_Home/wlserver_10.3/common/nodemanager/nmHome1/nodemanager.domains
                              NMProcess: DomainsFileEnabled=true
                              NMProcess: StateCheckInterval=500
                              NMProcess: QuitEnabled=true
                              NMProcess: UseMACBroadcast=false
                              NMProcess: DomainRegistrationEnabled=true
                              NMProcess: DomainsDirRemoteSharingEnabled=false
                              NMProcess:
                              NMProcess: Domain name mappings:
                              NMProcess:
                              NMProcess: EBS_domain_PROD -> /u01/apps/PROD/fs2/FMW_Home/user_projects/domains/EBS_domain_PROD
                              NMProcess:
                              NMProcess: <Mar 30, 2017 3:27:10 AM> <INFO> <EBS_domain_PROD> <forms_server1> <Startup configuration properties loaded from "/u01/apps/PROD/fs2/FMW_Home/user_projects/domains/EBS_domain_PROD/servers/forms_server1/data/nodemanager/startup.properties">
                              NMProcess: Mar 30, 2017 3:27:10 AM weblogic.nodemanager.server.AbstractServerManager log
                              NMProcess: INFO: Startup configuration properties loaded from "/u01/apps/PROD/fs2/FMW_Home/user_projects/domains/EBS_domain_PROD/servers/forms_server1/data/nodemanager/startup.properties"
                              NMProcess: <Mar 30, 2017 3:27:10 AM> <INFO> <EBS_domain_PROD> <oafm_server1> <Startup configuration properties loaded from "/u01/apps/PROD/fs2/FMW_Home/user_projects/domains/EBS_domain_PROD/servers/oafm_server1/data/nodemanager/startup.properties">
                              NMProcess: Mar 30, 2017 3:27:10 AM weblogic.nodemanager.server.AbstractServerManager log
                              NMProcess: INFO: Startup configuration properties loaded from "/u01/apps/PROD/fs2/FMW_Home/user_projects/domains/EBS_domain_PROD/servers/oafm_server1/data/nodemanager/startup.properties"
                              NMProcess: <Mar 30, 2017 3:27:10 AM> <INFO> <EBS_domain_PROD> <forms-c4ws_server1> <Startup configuration properties loaded from "/u01/apps/PROD/fs2/FMW_Home/user_projects/domains/EBS_domain_PROD/servers/forms-c4ws_server1/data/nodemanager/startup.properties">
                              NMProcess: Mar 30, 2017 3:27:10 AM weblogic.nodemanager.server.AbstractServerManager log
                              NMProcess: INFO: Startup configuration properties loaded from "/u01/apps/PROD/fs2/FMW_Home/user_projects/domains/EBS_domain_PROD/servers/forms-c4ws_server1/data/nodemanager/startup.properties"
                              NMProcess: <Mar 30, 2017 3:27:10 AM> <INFO> <EBS_domain_PROD> <oacore_server1> <Startup configuration properties loaded from "/u01/apps/PROD/fs2/FMW_Home/user_projects/domains/EBS_domain_PROD/servers/oacore_server1/data/nodemanager/startup.properties">
                              NMProcess: Mar 30, 2017 3:27:10 AM weblogic.nodemanager.server.AbstractServerManager log
                              NMProcess: INFO: Startup configuration properties loaded from "/u01/apps/PROD/fs2/FMW_Home/user_projects/domains/EBS_domain_PROD/servers/oacore_server1/data/nodemanager/startup.properties"
                              NMProcess: <Mar 30, 2017 3:27:10 AM> <INFO> <EBS_domain_PROD> <AdminServer> <Startup configuration properties loaded from "/u01/apps/PROD/fs2/FMW_Home/user_projects/domains/EBS_domain_PROD/servers/AdminServer/data/nodemanager/startup.properties">
                              NMProcess: Mar 30, 2017 3:27:10 AM weblogic.nodemanager.server.AbstractServerManager log
                              NMProcess: INFO: Startup configuration properties loaded from "/u01/apps/PROD/fs2/FMW_Home/user_projects/domains/EBS_domain_PROD/servers/AdminServer/data/nodemanager/startup.properties"
                              NMProcess: <Mar 30, 2017 3:27:10 AM> <INFO> <Plain socket listener started on port 5557, host app7.luminataerp.com>
                              NMProcess: Mar 30, 2017 3:27:10 AM weblogic.nodemanager.server.Listener run
                              NMProcess: INFO: Plain socket listener started on port 5557, host app7.luminataerp.com
                              NMProcess: <Mar 30, 2017 3:27:29 AM> <INFO> <EBS_domain_PROD> <AdminServer> <Startup configuration properties saved to "/u01/apps/PROD/fs2/FMW_Home/user_projects/domains/EBS_domain_PROD/servers/AdminServer/data/nodemanager/startup.properties">
                              NMProcess: Mar 30, 2017 3:27:29 AM weblogic.nodemanager.server.AbstractServerManager log
                              NMProcess: INFO: Startup configuration properties saved to "/u01/apps/PROD/fs2/FMW_Home/user_projects/domains/EBS_domain_PROD/servers/AdminServer/data/nodemanager/startup.properties"
                              NMProcess: <Mar 30, 2017 3:27:29 AM> <INFO> <EBS_domain_PROD> <AdminServer> <Rotated server output log to "/u01/apps/PROD/fs2/FMW_Home/user_projects/domains/EBS_domain_PROD/servers/AdminServer/logs/AdminServer.out00002">
                              NMProcess: Mar 30, 2017 3:27:29 AM weblogic.nodemanager.server.LogFileRotationUtil log
                              NMProcess: INFO: Rotated server output log to "/u01/apps/PROD/fs2/FMW_Home/user_projects/domains/EBS_domain_PROD/servers/AdminServer/logs/AdminServer.out00002"
                              NMProcess: <Mar 30, 2017 3:27:29 AM> <INFO> <EBS_domain_PROD> <AdminServer> <Server error log also redirected to server log>
                              NMProcess: Mar 30, 2017 3:27:29 AM weblogic.nodemanager.server.LogFileRotationUtil log
                              NMProcess: INFO: Server error log also redirected to server log
                              NMProcess: <Mar 30, 2017 3:27:29 AM> <INFO> <EBS_domain_PROD> <AdminServer> <Starting WebLogic server with command line: /u01/apps/PROD/fs2/EBSapps/comn/util/jdk64/jre/bin/java -Dweblogic.Name=AdminServer -Djava.security.policy=null -Djava.library.path=/u01/apps/PROD/fs2/FMW_Home/patch_wls1036/profiles/default/native:/u01/apps/PROD/fs2/EBSapps/10.1.2/jdk/jre/lib/i386:/u01/apps/PROD/fs2/EBSapps/10.1.2/jdk/jre/lib/i386/server:/u01/apps/PROD/fs2/EBSapps/10.1.2/jdk/jre/lib/i386/native_threads:/u01/apps/PROD/fs2/EBSapps/appl/cz/12.0.0/bin:/u01/apps/PROD/fs2/EBSapps/10.1.2/lib32:/u01/apps/PROD/fs2/EBSapps/10.1.2/lib:/usr/X11R6/lib:/usr/openwin/lib:/u01/apps/PROD/fs2/EBSapps/10.1.2/jdk/jre/lib/i386:/u01/apps/PROD/fs2/EBSapps/10.1.2/jdk/jre/lib/i386/server:/u01/apps/PROD/fs2/EBSapps/10.1.2/jdk/jre/lib/i386/native_threads:/u01/apps/PROD/fs2/EBSapps/appl/sht/12.0.0/lib:/u01/apps/PROD/fs2/FMW_Home/wlserver_10.3/server/native/linux/x86_64:/u01/apps/PROD/fs2/FMW_Home/wlserver_10.3/server/native/linux/x86_64/oci920_8:/usr/java/packages/lib/amd64:/usr/lib64:/lib64:/lib:/usr/lib -Djava.class.path=/u01/apps/PROD/fs2/FMW_Home/patch_wls1036/profiles/default/sys_manifest_classpath/weblogic_patch.jar:/u01/apps/PROD/fs2/FMW_Home/wlserver_10.3/server/lib/weblogic_sp.jar:/u01/apps/PROD/fs2/FMW_Home/wlserver_10.3/server/lib/weblogic.jar:/u01/apps/PROD/fs2/FMW_Home/modules/features/weblogic.server.modules_10.3.6.0.jar:/u01/apps/PROD/fs2/FMW_Home/wlserver_10.3/server/lib/webservices.jar:/u01/apps/PROD/fs2/FMW_Home/modules/org.apache.ant_1.7.1/lib/ant-all.jar:/u01/apps/PROD/fs2/FMW_Home/modules/net.sf.antcontrib_1.1.0.0_1-0b2/lib/ant-contrib.jar:/u01/apps/PROD/fs2/FMW_Home/oracle_common/modules/oracle.jdbc_11.1.1/ojdbc6dms.jar:/u01/apps/PROD/fs2/FMW_Home/oracle_common/webcenter/modules/oracle.portlet.server_11.1.1/oracle-portlet-api.jar:/u01/apps/PROD/fs2/FMW_Home/oracle_common/modules/oracle.jrf_11.1.1/jrf.jar:/u01/apps/PROD/fs2/FMW_Home/wlserver_10.3/common/derby/lib/derbyclient.jar -Dweblogic.system.BootIdentityFile=/u01/apps/PROD/fs2/FMW_Home/user_projects/domains/EBS_domain_PROD/servers/AdminServer/security/boot.properties -Dweblogic.nodemanager.ServiceEnabled=true -XX:PermSize=128m -XX:MaxPermSize=384m -Xms512m -Xmx512m -Djava.security.policy=/u01/apps/PROD/fs2/FMW_Home/wlserver_10.3/server/lib/weblogic.policy -Djava.security.egd=file:/dev/./urandom -Dweblogic.ProductionModeEnabled=true -da -Dplatform.home=/u01/apps/PROD/fs2/FMW_Home/wlserver_10.3 -Dwls.home=/u01/apps/PROD/fs2/FMW_Home/wlserver_10.3/server -Dweblogic.home=/u01/apps/PROD/fs2/FMW_Home/wlserver_10.3/server -Dcommon.components.home=/u01/apps/PROD/fs2/FMW_Home/oracle_common -Djrf.version=11.1.1 -Dorg.apache.commons.logging.Log=org.apache.commons.logging.impl.Jdk14Logger -Ddomain.home=/u01/apps/PROD/fs2/FMW_Home/user_projects/domains/EBS_domain_PROD -Doracle.server.config.dir=/u01/apps/PROD/fs2/FMW_Home/user_projects/domains/EBS_domain_PROD/config/fmwconfig/servers/AdminServer -Doracle.domain.config.dir=/u01/apps/PROD/fs2/FMW_Home/user_projects/domains/EBS_domain_PROD/config/fmwconfig -Digf.arisidbeans.carmlloc=/u01/apps/PROD/fs2/FMW_Home/user_projects/domains/EBS_domain_PROD/config/fmwconfig/carml -Digf.arisidstack.home=/u01/apps/PROD/fs2/FMW_Home/user_projects/domains/EBS_domain_PROD/config/fmwconfig/arisidprovider -Doracle.security.jps.config=/u01/apps/PROD/fs2/FMW_Home/user_projects/domains/EBS_domain_PROD/config/fmwconfig/jps-config.xml -Doracle.deployed.app.dir=/u01/apps/PROD/fs2/FMW_Home/user_projects/domains/EBS_domain_PROD/servers/AdminServer/tmp/_WL_user -Doracle.deployed.app.ext=/- -Dweblogic.alternateTypesDirectory=/u01/apps/PROD/fs2/FMW_Home/oracle_common/modules/oracle.ossoiap_11.1.1,/u01/apps/PROD/fs2/FMW_Home/oracle_common/modules/oracle.oamprovider_11.1.1 -Djava.protocol.handler.pkgs=oracle.mds.net.protocol -Dweblogic.jdbc.remoteEnabled=false -Dportlet.oracle.home=/u01/apps/PROD/fs2/FMW_Home/oracle_common -Dem.oracle.home=/u01/apps/PROD/fs2/FMW_Home/oracle_common -Dweblogic.management.discover=true -Dwlw.iterativeDev=false -Dwlw.testConsole=false -Dwlw.logErrorsToConsole=false -Dweblogic.ext.dirs=/u01/apps/PROD/fs2/FMW_Home/patch_wls1036/profiles/default/sysext_manifest_classpath weblogic.Server >
                              NMProcess: Mar 30, 2017 3:27:29 AM weblogic.nodemanager.server.AbstractServerManager log
                              NMProcess: INFO: Starting WebLogic server with command line: /u01/apps/PROD/fs2/EBSapps/comn/util/jdk64/jre/bin/java -Dweblogic.Name=AdminServer -Djava.security.policy=null -Djava.library.path=/u01/apps/PROD/fs2/FMW_Home/patch_wls1036/profiles/default/native:/u01/apps/PROD/fs2/EBSapps/10.1.2/jdk/jre/lib/i386:/u01/apps/PROD/fs2/EBSapps/10.1.2/jdk/jre/lib/i386/server:/u01/apps/PROD/fs2/EBSapps/10.1.2/jdk/jre/lib/i386/native_threads:/u01/apps/PROD/fs2/EBSapps/appl/cz/12.0.0/bin:/u01/apps/PROD/fs2/EBSapps/10.1.2/lib32:/u01/apps/PROD/fs2/EBSapps/10.1.2/lib:/usr/X11R6/lib:/usr/openwin/lib:/u01/apps/PROD/fs2/EBSapps/10.1.2/jdk/jre/lib/i386:/u01/apps/PROD/fs2/EBSapps/10.1.2/jdk/jre/lib/i386/server:/u01/apps/PROD/fs2/EBSapps/10.1.2/jdk/jre/lib/i386/native_threads:/u01/apps/PROD/fs2/EBSapps/appl/sht/12.0.0/lib:/u01/apps/PROD/fs2/FMW_Home/wlserver_10.3/server/native/linux/x86_64:/u01/apps/PROD/fs2/FMW_Home/wlserver_10.3/server/native/linux/x86_64/oci920_8:/usr/java/packages/lib/amd64:/usr/lib64:/lib64:/lib:/usr/lib -Djava.class.path=/u01/apps/PROD/fs2/FMW_Home/patch_wls1036/profiles/default/sys_manifest_classpath/weblogic_patch.jar:/u01/apps/PROD/fs2/FMW_Home/wlserver_10.3/server/lib/weblogic_sp.jar:/u01/apps/PROD/fs2/FMW_Home/wlserver_10.3/server/lib/weblogic.jar:/u01/apps/PROD/fs2/FMW_Home/modules/features/weblogic.server.modules_10.3.6.0.jar:/u01/apps/PROD/fs2/FMW_Home/wlserver_10.3/server/lib/webservices.jar:/u01/apps/PROD/fs2/FMW_Home/modules/org.apache.ant_1.7.1/lib/ant-all.jar:/u01/apps/PROD/fs2/FMW_Home/modules/net.sf.antcontrib_1.1.0.0_1-0b2/lib/ant-contrib.jar:/u01/apps/PROD/fs2/FMW_Home/oracle_common/modules/oracle.jdbc_11.1.1/ojdbc6dms.jar:/u01/apps/PROD/fs2/FMW_Home/oracle_common/webcenter/modules/oracle.portlet.server_11.1.1/oracle-portlet-api.jar:/u01/apps/PROD/fs2/FMW_Home/oracle_common/modules/oracle.jrf_11.1.1/jrf.jar:/u01/apps/PROD/fs2/FMW_Home/wlserver_10.3/common/derby/lib/derbyclient.jar -Dweblogic.system.BootIdentityFile=/u01/apps/PROD/fs2/FMW_Home/user_projects/domains/EBS_domain_PROD/servers/AdminServer/security/boot.properties -Dweblogic.nodemanager.ServiceEnabled=true -XX:PermSize=128m -XX:MaxPermSize=384m -Xms512m -Xmx512m -Djava.security.policy=/u01/apps/PROD/fs2/FMW_Home/wlserver_10.3/server/lib/weblogic.policy -Djava.security.egd=file:/dev/./urandom -Dweblogic.ProductionModeEnabled=true -da -Dplatform.home=/u01/apps/PROD/fs2/FMW_Home/wlserver_10.3 -Dwls.home=/u01/apps/PROD/fs2/FMW_Home/wlserver_10.3/server -Dweblogic.home=/u01/apps/PROD/fs2/FMW_Home/wlserver_10.3/server -Dcommon.components.home=/u01/apps/PROD/fs2/FMW_Home/oracle_common -Djrf.version=11.1.1 -Dorg.apache.commons.logging.Log=org.apache.commons.logging.impl.Jdk14Logger -Ddomain.home=/u01/apps/PROD/fs2/FMW_Home/user_projects/domains/EBS_domain_PROD -Doracle.server.config.dir=/u01/apps/PROD/fs2/FMW_Home/user_projects/domains/EBS_domain_PROD/config/fmwconfig/servers/AdminServer -Doracle.domain.config.dir=/u01/apps/PROD/fs2/FMW_Home/user_projects/domains/EBS_domain_PROD/config/fmwconfig -Digf.arisidbeans.carmlloc=/u01/apps/PROD/fs2/FMW_Home/user_projects/domains/EBS_domain_PROD/config/fmwconfig/carml -Digf.arisidstack.home=/u01/apps/PROD/fs2/FMW_Home/user_projects/domains/EBS_domain_PROD/config/fmwconfig/arisidprovider -Doracle.security.jps.config=/u01/apps/PROD/fs2/FMW_Home/user_projects/domains/EBS_domain_PROD/config/fmwconfig/jps-config.xml -Doracle.deployed.app.dir=/u01/apps/PROD/fs2/FMW_Home/user_projects/domains/EBS_domain_PROD/servers/AdminServer/tmp/_WL_user -Doracle.deployed.app.ext=/- -Dweblogic.alternateTypesDirectory=/u01/apps/PROD/fs2/FMW_Home/oracle_common/modules/oracle.ossoiap_11.1.1,/u01/apps/PROD/fs2/FMW_Home/oracle_common/modules/oracle.oamprovider_11.1.1 -Djava.protocol.handler.pkgs=oracle.mds.net.protocol -Dweblogic.jdbc.remoteEnabled=false -Dportlet.oracle.home=/u01/apps/PROD/fs2/FMW_Home/oracle_common -Dem.oracle.home=/u01/apps/PROD/fs2/FMW_Home/oracle_common -Dweblogic.management.discover=true -Dwlw.iterativeDev=false -Dwlw.testConsole=false -Dwlw.logErrorsToConsole=false -Dweblogic.ext.dirs=/u01/apps/PROD/fs2/FMW_Home/patch_wls1036/profiles/default/sysext_manifest_classpath weblogic.Server
                              NMProcess: <Mar 30, 2017 3:27:29 AM> <INFO> <EBS_domain_PROD> <AdminServer> <Working directory is '/u01/apps/PROD/fs2/FMW_Home/user_projects/domains/EBS_domain_PROD'>
                              NMProcess: Mar 30, 2017 3:27:29 AM weblogic.nodemanager.server.AbstractServerManager log
                              NMProcess: INFO: Working directory is '/u01/apps/PROD/fs2/FMW_Home/user_projects/domains/EBS_domain_PROD'
                              NMProcess: <Mar 30, 2017 3:27:29 AM> <INFO> <EBS_domain_PROD> <AdminServer> <Rotated server output log to "/u01/apps/PROD/fs2/FMW_Home/user_projects/domains/EBS_domain_PROD/servers/AdminServer/logs/AdminServer.out00003">
                              NMProcess: Mar 30, 2017 3:27:29 AM weblogic.nodemanager.server.LogFileRotationUtil log
                              NMProcess: INFO: Rotated server output log to "/u01/apps/PROD/fs2/FMW_Home/user_projects/domains/EBS_domain_PROD/servers/AdminServer/logs/AdminServer.out00003"
                              NMProcess: <Mar 30, 2017 3:27:29 AM> <INFO> <EBS_domain_PROD> <AdminServer> <Server error log also redirected to server log>
                              NMProcess: Mar 30, 2017 3:27:29 AM weblogic.nodemanager.server.LogFileRotationUtil log
                              NMProcess: INFO: Server error log also redirected to server log
                              NMProcess: <Mar 30, 2017 3:27:29 AM> <INFO> <EBS_domain_PROD> <AdminServer> <Server output log file is '/u01/apps/PROD/fs2/FMW_Home/user_projects/domains/EBS_domain_PROD/servers/AdminServer/logs/AdminServer.out'>
                              NMProcess: Mar 30, 2017 3:27:29 AM weblogic.nodemanager.server.AbstractServerManager log
                              NMProcess: INFO: Server output log file is '/u01/apps/PROD/fs2/FMW_Home/user_projects/domains/EBS_domain_PROD/servers/AdminServer/logs/AdminServer.out'
                              Refer /u01/apps/PROD/fs2/inst/apps/PROD_app7/logs/appl/admin/log/adadminsrvctl.txt for details

                              adadminsrvctl.sh: exiting with status 0

                              adadminsrvctl.sh: check the logfile /u01/apps/PROD/fs2/inst/apps/PROD_app7/logs/appl/admin/log/adadminsrvctl.txt for more information ... 

                              [applprod@app7 scripts]$

                               

                              ==========================================

                               

                              In my first message there is a error like

                               

                              RC-50208: Exception  in method TimedProcessProcess.run
                              Raised by oracle.apps.ad.util.TimedProcess$TimedProcessProcess: java.io.IOException: Cannot run program "/u01/apps/PROD/fs1/FMW_Home/oracle_common/bin/copyBinary.sh": error=13, P

                              ermission denied

                              Script Executed in 101 milliseconds, returning status -1

                              ERROR: Script timed out.

                              [applprod@app7 ~]$

                               

                              could you please see this and one thing as per the Oracle E-Business Suite Release 12.2: Consolidated List of Patches and Technology Bug Fixes (Doc ID 1594274.1) I have applied those patch on fs1 but now I checked those on patch file system fs2 and patch is not applied there.

                               

                              Please see also this

                               

                              -------------------------------

                              [applprod@app7 scripts]$ ls -l /u01/apps/PROD/fs1/FMW_Home/oracle_common/bin/*.sh
                              -rw-r--r-- 1 applprod dba 3518 Oct 8 2015 /u01/apps/PROD/fs1/FMW_Home/oracle_common/bin/copyBinary.sh
                              -rw-r--r-- 1 applprod dba 4569 Oct 8 2015 /u01/apps/PROD/fs1/FMW_Home/oracle_common/bin/copyConfig.sh
                              -rw-r--r-- 1 applprod dba 3272 Oct 8 2015 /u01/apps/PROD/fs1/FMW_Home/oracle_common/bin/extractMovePlan.sh
                              -rwxr-x--- 1 applprod dba 2119 Sep 12 2013 /u01/apps/PROD/fs1/FMW_Home/oracle_common/bin/libovdadapterconfig.sh
                              -rwxr-x--- 1 applprod dba 2119 Sep 12 2013 /u01/apps/PROD/fs1/FMW_Home/oracle_common/bin/libovdconfig.sh
                              -rwxr-x--- 1 applprod dba 7551 Dec 17 2014 /u01/apps/PROD/fs1/FMW_Home/oracle_common/bin/OAM_SSL_Server_Config.sh
                              -rwxr-x--- 1 applprod dba 11045 Dec 17 2014 /u01/apps/PROD/fs1/FMW_Home/oracle_common/bin/OAMWG_SSL_Client_Config.sh
                              -rw-r--r-- 1 applprod dba 3470 Oct 8 2015 /u01/apps/PROD/fs1/FMW_Home/oracle_common/bin/obfuscatePassword.sh
                              -rwxr-x--- 1 applprod dba 9203 Dec 17 2014 /u01/apps/PROD/fs1/FMW_Home/oracle_common/bin/OID_SSL_Server_Config.sh
                              -rwxr-x--- 1 applprod dba 13019 Dec 17 2014 /u01/apps/PROD/fs1/FMW_Home/oracle_common/bin/OVD_SSL_Server_Config.sh
                              -rw-r--r-- 1 applprod dba 4437 Oct 8 2015 /u01/apps/PROD/fs1/FMW_Home/oracle_common/bin/pasteBinary.sh
                              -rw-r--r-- 1 applprod dba 5015 Oct 8 2015 /u01/apps/PROD/fs1/FMW_Home/oracle_common/bin/pasteConfig.sh
                              -rwxr-x--- 1 applprod dba 951 Jan 20 2009 /u01/apps/PROD/fs1/FMW_Home/oracle_common/bin/patchnfs.sh
                              -rwxr-x--- 1 applprod dba 22674 Dec 17 2014 /u01/apps/PROD/fs1/FMW_Home/oracle_common/bin/SSLClientConfig.sh
                              -rwxr-x--- 1 applprod dba 11634 Dec 17 2014 /u01/apps/PROD/fs1/FMW_Home/oracle_common/bin/SSLGenCA.sh
                              -rwxr-x--- 1 applprod dba 19779 Dec 17 2014 /u01/apps/PROD/fs1/FMW_Home/oracle_common/bin/SSLServerConfig.sh
                              -rwxr-x--- 1 applprod dba 6443 Dec 17 2014 /u01/apps/PROD/fs1/FMW_Home/oracle_common/bin/WLS_SSL_Client_Config.sh
                              -rwxr-x--- 1 applprod dba 7274 Dec 17 2014 /u01/apps/PROD/fs1/FMW_Home/oracle_common/bin/WLS_SSL_Server_Config.sh
                              [applprod@app7 scripts]$ ls -l /u01/apps/PROD/fs2/FMW_Home/oracle_common/bin/*.sh
                              -rwxr-x--- 1 applprod dba 3470 Nov 25 2014 /u01/apps/PROD/fs2/FMW_Home/oracle_common/bin/copyBinary.sh
                              -rwxr-x--- 1 applprod dba 4527 Nov 25 2014 /u01/apps/PROD/fs2/FMW_Home/oracle_common/bin/copyConfig.sh
                              -rwxr-x--- 1 applprod dba 3224 Nov 25 2014 /u01/apps/PROD/fs2/FMW_Home/oracle_common/bin/extractMovePlan.sh
                              -rwxr-x--- 1 applprod dba 2119 Sep 12 2013 /u01/apps/PROD/fs2/FMW_Home/oracle_common/bin/libovdadapterconfig.sh
                              -rwxr-x--- 1 applprod dba 2119 Sep 12 2013 /u01/apps/PROD/fs2/FMW_Home/oracle_common/bin/libovdconfig.sh
                              -rwxr-x--- 1 applprod dba 7551 Dec 17 2014 /u01/apps/PROD/fs2/FMW_Home/oracle_common/bin/OAM_SSL_Server_Config.sh
                              -rwxr-x--- 1 applprod dba 11045 Dec 17 2014 /u01/apps/PROD/fs2/FMW_Home/oracle_common/bin/OAMWG_SSL_Client_Config.sh
                              -rwxr-x--- 1 applprod dba 3423 Nov 23 2014 /u01/apps/PROD/fs2/FMW_Home/oracle_common/bin/obfuscatePassword.sh
                              -rwxr-x--- 1 applprod dba 9203 Dec 17 2014 /u01/apps/PROD/fs2/FMW_Home/oracle_common/bin/OID_SSL_Server_Config.sh
                              -rwxr-x--- 1 applprod dba 13019 Dec 17 2014 /u01/apps/PROD/fs2/FMW_Home/oracle_common/bin/OVD_SSL_Server_Config.sh
                              -rwxr-x--- 1 applprod dba 4390 Nov 25 2014 /u01/apps/PROD/fs2/FMW_Home/oracle_common/bin/pasteBinary.sh
                              -rwxr-x--- 1 applprod dba 4968 Nov 25 2014 /u01/apps/PROD/fs2/FMW_Home/oracle_common/bin/pasteConfig.sh
                              -rwxr-x--- 1 applprod dba 951 Jan 20 2009 /u01/apps/PROD/fs2/FMW_Home/oracle_common/bin/patchnfs.sh
                              -rwxr-x--- 1 applprod dba 22674 Dec 17 2014 /u01/apps/PROD/fs2/FMW_Home/oracle_common/bin/SSLClientConfig.sh
                              -rwxr-x--- 1 applprod dba 11634 Dec 17 2014 /u01/apps/PROD/fs2/FMW_Home/oracle_common/bin/SSLGenCA.sh
                              -rwxr-x--- 1 applprod dba 19779 Dec 17 2014 /u01/apps/PROD/fs2/FMW_Home/oracle_common/bin/SSLServerConfig.sh
                              -rwxr-x--- 1 applprod dba 6443 Dec 17 2014 /u01/apps/PROD/fs2/FMW_Home/oracle_common/bin/WLS_SSL_Client_Config.sh
                              -rwxr-x--- 1 applprod dba 7274 Dec 17 2014 /u01/apps/PROD/fs2/FMW_Ho

                               

                              --------------

                              Thanks

                              Rakib

                              • 12. Re: adop phase=fs_clone error on EBS 12.2.6
                                1042232

                                WLS server not running on patch file system while running that adop session.

                                 

                                thanks

                                Rakib

                                • 13. Re: adop phase=fs_clone error on EBS 12.2.6
                                  mdtaylor

                                  Try renaming any /u01/apps/PROD/fs2/FMW_Home% directories and retry the fs_clone after ensuring no fs2 processes are running.

                                  • 14. Re: adop phase=fs_clone error on EBS 12.2.6
                                    1042232

                                    More error this time.

                                     

                                    =======================\

                                     

                                     

                                    [applprod@app7 ~]$ adop phase=fs_clone

                                    Enter the APPS password:
                                    Enter the SYSTEM password:
                                    Enter the WLSADMIN password:

                                    Validating credentials.

                                    Initializing.
                                        Run Edition context  : /u01/apps/PROD/fs1/inst/apps/PROD_app7/appl/admin/PROD_app7.xml
                                        Patch edition context: /u01/apps/PROD/fs2/inst/apps/PROD_app7/appl/admin/PROD_app7.xml
                                        Patch file system free space: 285.97 GB

                                    Validating system setup.
                                        Node registry is valid.

                                    Checking for existing adop sessions.
                                        No pending session exists.
                                        Starting new adop session.

                                    ===========================================================================
                                    ADOP (C.Delta.8)
                                    Session ID: 3
                                    Node: app7
                                    Phase: fs_clone
                                    Log: /u01/apps/PROD/fs_ne/EBSapps/log/adop/3/20170330_040256/adop.log
                                    ===========================================================================

                                    Validating configuration on node: [app7].
                                        Log: /u01/apps/PROD/fs_ne/EBSapps/log/adop/3/20170330_040256/fs_clone/validate/app7
                                            [WARNING]: There could be issues while validating the ports used for E-Business Suite instance against ports used in /etc/services. Refer the log file for more details.

                                    Checking for pending cleanup actions.
                                        No pending cleanup actions found.

                                    Blocking managed server ports.
                                        Log: /u01/apps/PROD/fs_ne/EBSapps/log/adop/3/20170330_040256/fs_clone/app7/txkCloneAcquirePort.log

                                    Performing CLONE steps.
                                        Log: /u01/apps/PROD/fs_ne/EBSapps/log/adop/3/20170330_040256/fs_clone/app7

                                     

                                    Beginning application tier FSCloneStage - Thu Mar 30 04:06:03 2017

                                    /u01/apps/PROD/fs1/EBSapps/comn/util/jdk32/bin/java -Xmx600M -DCONTEXT_VALIDATED=false -Doracle.installer.oui_loc=/oui -classpath /u01/apps/PROD/fs1/FMW_Home/webtier/lib/xmlparserv2.jar:/u01/apps/PROD/fs1/FMW_Home/webtier/jdbc/lib/ojdbc6.jar:/u01/apps/PROD/fs1/EBSapps/comn/java/classes:/u01/apps/PROD/fs1/FMW_Home/webtier/oui/jlib/OraInstaller.jar:/u01/apps/PROD/fs1/FMW_Home/webtier/oui/jlib/ewt3.jar:/u01/apps/PROD/fs1/FMW_Home/webtier/oui/jlib/share.jar:/u01/apps/PROD/fs1/FMW_Home/webtier/../Oracle_EBS-app1/oui/jlib/srvm.jar:/u01/apps/PROD/fs1/FMW_Home/webtier/jlib/ojmisc.jar:/u01/apps/PROD/fs1/FMW_Home/wlserver_10.3/server/lib/weblogic.jar:/u01/apps/PROD/fs1/FMW_Home/oracle_common/jlib/obfuscatepassword.jar  oracle.apps.ad.clone.FSCloneStageAppsTier -e /u01/apps/PROD/fs1/inst/apps/PROD_app7/appl/admin/PROD_app7.xml -targ /u01/apps/PROD/fs2/inst/apps/PROD_app7/appl/admin/PROD_app7.xml -stage /u01/apps/PROD/fs1/EBSapps/comn/adopclone_app7 -tmp /tmp -component appsTier -nopromptmsg
                                    Log file located at /u01/apps/PROD/fs1/inst/apps/PROD_app7/admin/log/clone/FSCloneStageAppsTier_03300406.log

                                    ERROR while running FSCloneStage...
                                    Thu Mar 30 04:07:13 2017
                                    *******FATAL ERROR*******
                                    PROGRAM : (/u01/apps/PROD/fs1/EBSapps/appl/ad/12.0.0/patch/115/bin/txkADOPPreparePhaseSynchronize.pl)
                                    TIME    : Thu Mar 30 04:07:13 2017
                                    FUNCTION: main::runFSCloneStage [ Level 1 ]
                                    ERRORMSG: /u01/apps/PROD/fs1/EBSapps/appl/ad/12.0.0/bin/adclone.pl did not go through successfully.

                                        [UNEXPECTED]Error occurred running "perl /u01/apps/PROD/fs1/EBSapps/appl/ad/12.0.0/patch/115/bin/txkADOPPreparePhaseSynchronize.pl -contextfile=/u01/apps/PROD/fs1/inst/apps/PROD_app7/appl/admin/PROD_app7.xml -patchcontextfile=/u01/apps/PROD/fs2/inst/apps/PROD_app7/appl/admin/PROD_app7.xml -promptmsg=hide -console=off -mode=create -sync_mode=copy -sessionid=3 -timestamp=20170330_040256 -outdir=/u01/apps/PROD/fs_ne/EBSapps/log/adop/3/20170330_040256/fs_clone/app7"
                                        [UNEXPECTED]occurred during CLONE Patch File System from Run File System, running command: "perl /u01/apps/PROD/fs1/EBSapps/appl/ad/12.0.0/patch/115/bin/txkADOPPreparePhaseSynchronize.pl -contextfile=/u01/apps/PROD/fs1/inst/apps/PROD_app7/appl/admin/PROD_app7.xml -patchcontextfile=/u01/apps/PROD/fs2/inst/apps/PROD_app7/appl/admin/PROD_app7.xml -promptmsg=hide -console=off -mode=create -sync_mode=copy -sessionid=3 -timestamp=20170330_040256 -outdir=/u01/apps/PROD/fs_ne/EBSapps/log/adop/3/20170330_040256/fs_clone/app7".
                                        Releasing managed server ports.
                                        Log: /u01/apps/PROD/fs_ne/EBSapps/log/adop/3/20170330_040256/fs_clone/app7/txkCloneAcquirePort.log
                                        Stopping services on patch file system.
                                        Stopping admin server.

                                    You are running adadminsrvctl.sh version 120.10.12020000.2


                                    OAH_TOP is set to a directory that does not exist.

                                    Current setting is "/u01/apps/PROD/fs2/FMW_Home/Oracle_EBS-app1/applications/oacore".

                                    Please create the directory or modify the variable
                                    in $APPL_TOP/admin/adovars.env.

                                    /u01/apps/PROD/fs2/inst/apps/PROD_app7/appl/admin/adovars_PROD_app7.env: line 280: 9: generating a fatal error.
                                        [UNEXPECTED]Error occurred running "sh /u01/apps/PROD/fs2/inst/apps/PROD_app7/admin/scripts/adadminsrvctl.sh  stop -nopromptmsg"
                                        [UNEXPECTED]Error running adadminsrvctl command


                                    [STATEMENT] Please run adopscanlog utility, using the command

                                    "adopscanlog -latest=yes"

                                    to get the list of the log files along with snippet of the error message corresponding to each log file.


                                    adop exiting with status = 2 (Fail)
                                    [applprod@app7 ~]$ adopscanlog -latest=yes

                                    Scanning /u01/apps/PROD/fs_ne/EBSapps/log/adop/3/ directory ...

                                    /u01/apps/PROD/fs_ne/EBSapps/log/adop/3/20170330_040256/fs_clone/app7/TXK_SYNC_create/fsclone_stage/FSCloneStageAppsTier_03300406.log:
                                    --------------------------------------------------------------------------------------------------------------------------------------

                                    Lines #(249-253):
                                    START: Creating FMW archive.
                                    Running /u01/apps/PROD/fs1/FMW_Home/oracle_common/bin/copyBinary.sh -javaHome /u01/apps/PROD/fs1/EBSapps/comn/adopclone_app7/FMW/t2pjdk -al /u01/apps/PROD/fs1/EBSapps/comn/adopclone_app7/FMW/FMW_Home.jar -smw /u01/apps/PROD/fs1/FMW_Home -ldl /u01/apps/PROD/fs1/inst/apps/PROD_app7/admin/log/clone/fmwT2PStage -invPtrLoc /etc/oraInst.loc -silent true -debug true
                                    RC-50208: Exception  in method TimedProcessProcess.run
                                    Raised by oracle.apps.ad.util.TimedProcess$TimedProcessProcess: java.io.IOException: Cannot run program "/u01/apps/PROD/fs1/FMW_Home/oracle_common/bin/copyBinary.sh": error=13, Permission denied
                                    Script Executed in 100 milliseconds, returning status -1

                                    Lines #(252-254):
                                    Raised by oracle.apps.ad.util.TimedProcess$TimedProcessProcess: java.io.IOException: Cannot run program "/u01/apps/PROD/fs1/FMW_Home/oracle_common/bin/copyBinary.sh": error=13, Permission denied
                                    Script Executed in 100 milliseconds, returning status -1
                                    ERROR: Script timed out.

                                    /u01/apps/PROD/fs_ne/EBSapps/log/adop/3/20170330_040256/fs_clone/app7/TXK_SYNC_create/txkADOPPreparePhaseSynchronize.log:
                                    -------------------------------------------------------------------------------------------------------------------------

                                    Lines #(129-131):
                                    TIME    : Thu Mar 30 04:07:13 2017
                                    FUNCTION: main::runFSCloneStage [ Level 1 ]
                                    ERRORMSG: /u01/apps/PROD/fs1/EBSapps/appl/ad/12.0.0/bin/adclone.pl did not go through successfully.

                                    /u01/apps/PROD/fs_ne/EBSapps/log/adop/3/20170330_040256/adop.log:
                                    -----------------------------------------------------------------

                                    Lines #(109-114):
                                        [PROCEDURE] Calling: /u01/apps/PROD/fs1/EBSapps/appl/ad/12.0.0/patch/115/bin/txkADOPPreparePhaseSynchronize.pl
                                        [EVENT]     Log: /u01/apps/PROD/fs_ne/EBSapps/log/adop/3/20170330_040256/fs_clone/app7
                                        [UNEXPECTED]Error occurred running "perl /u01/apps/PROD/fs1/EBSapps/appl/ad/12.0.0/patch/115/bin/txkADOPPreparePhaseSynchronize.pl -contextfile=/u01/apps/PROD/fs1/inst/apps/PROD_app7/appl/admin/PROD_app7.xml -patchcontextfile=/u01/apps/PROD/fs2/inst/apps/PROD_app7/appl/admin/PROD_app7.xml -promptmsg=hide -console=off -mode=create -sync_mode=copy -sessionid=3 -timestamp=20170330_040256 -outdir=/u01/apps/PROD/fs_ne/EBSapps/log/adop/3/20170330_040256/fs_clone/app7"
                                        [UNEXPECTED]occurred during CLONE Patch File System from Run File System, running command: "perl /u01/apps/PROD/fs1/EBSapps/appl/ad/12.0.0/patch/115/bin/txkADOPPreparePhaseSynchronize.pl -contextfile=/u01/apps/PROD/fs1/inst/apps/PROD_app7/appl/admin/PROD_app7.xml -patchcontextfile=/u01/apps/PROD/fs2/inst/apps/PROD_app7/appl/admin/PROD_app7.xml -promptmsg=hide -console=off -mode=create -sync_mode=copy -sessionid=3 -timestamp=20170330_040256 -outdir=/u01/apps/PROD/fs_ne/EBSapps/log/adop/3/20170330_040256/fs_clone/app7".
                                        [EVENT]     Releasing managed server ports.
                                            [PROCEDURE] [START 2017/03/30 04:07:13] Releasing ports

                                    Lines #(130-135):
                                                [PROCEDURE] [START 2017/03/30 04:07:13] Check and stop patch Admin Server
                                                [PROCEDURE] [START 2017/03/30 04:07:13] Check and Stop patch FS Admin Server
                                                [UNEXPECTED]Error occurred running "sh /u01/apps/PROD/fs2/inst/apps/PROD_app7/admin/scripts/adadminsrvctl.sh  stop -nopromptmsg"
                                                [UNEXPECTED]Error running adadminsrvctl command
                                            [PROCEDURE] [START 2017/03/30 04:07:14] Unlocking sessions table
                                            [STATEMENT] Unlocking ad_adop_sessions table for app7 with wait interval of 60 seconds and number of tries 2
                                    [applprod@app7 ~]$

                                    =================================================================================================

                                    [root@app7 ~]# tail -f /u01/apps/PROD/fs1/inst/apps/PROD_app7/admin/log/clone/FSCloneStageAppsTier_03300406.log
                                    copying /u01/apps/PROD/fs1/EBSapps/comn/adopclone_app7//jlib/oui//jlib/oracle_ice.jar
                                    copying /u01/apps/PROD/fs1/EBSapps/comn/adopclone_app7//jlib/oui//jlib/srvm.jar
                                    copying /u01/apps/PROD/fs1/EBSapps/comn/adopclone_app7//jlib/oui//jlib/help4.jar
                                    copying /u01/apps/PROD/fs1/EBSapps/comn/adopclone_app7//jlib/oui//jlib/jewt4.jar
                                    copying /u01/apps/PROD/fs1/EBSapps/comn/adopclone_app7//jlib/oui//jlib/classes12.jar
                                    copying /u01/apps/PROD/fs1/EBSapps/comn/adopclone_app7//jlib/oui//jlib/swingaccess.jar
                                    copying /u01/apps/PROD/fs1/EBSapps/comn/adopclone_app7//jlib/oui//jlib/jewt4-nls.jar
                                    copying /u01/apps/PROD/fs1/EBSapps/comn/adopclone_app7//jlib/oui//jlib/ewt3-swingaccess.jar
                                    copying /u01/apps/PROD/fs1/EBSapps/comn/adopclone_app7//jlib/oui//jlib/xmlparserv2.jar
                                    Copy OUI from /u01/apps/PROD/fs1/EBSapps/10.1.2/oui/lib to /u01/apps/PROD/fs1/EBSapps/comn/adopclone_app7//oui/
                                    Creating FMW staging directories
                                    Creating log directory
                                    Creating OHS instance archive stage directory
                                    Creating Weblogic domain archive stage directory
                                    Creating t2pjdk directory
                                    Creating prereq/webtier directory
                                    Attempting to delete: /u01/apps/PROD/fs1/EBSapps/comn/adopclone_app7//prereq
                                    Copying /u01/apps/PROD/fs1/FMW_Home/webtier/oui to /u01/apps/PROD/fs1/EBSapps/comn/adopclone_app7//prereq/webtier
                                    Copying /u01/apps/PROD/fs1/FMW_Home/webtier/inventory/Scripts to /u01/apps/PROD/fs1/EBSapps/comn/adopclone_app7//prereq/webtier

                                    START: Creating FMW archive.
                                    Running /u01/apps/PROD/fs1/FMW_Home/oracle_common/bin/copyBinary.sh -javaHome /u01/apps/PROD/fs1/EBSapps/comn/adopclone_app7/FMW/t2pjdk -al /u01/apps/PROD/fs1/EBSapps/comn/adopclone_app7/FMW/FMW_Home.jar -smw /u01/apps/PROD/fs1/FMW_Home -ldl /u01/apps/PROD/fs1/inst/apps/PROD_app7/admin/log/clone/fmwT2PStage -invPtrLoc /etc/oraInst.loc -silent true -debug true
                                    RC-50208: Exception  in method TimedProcessProcess.run
                                    Raised by oracle.apps.ad.util.TimedProcess$TimedProcessProcess: java.io.IOException: Cannot run program "/u01/apps/PROD/fs1/FMW_Home/oracle_common/bin/copyBinary.sh": error=13, Permission denied
                                    Script Executed in 100 milliseconds, returning status -1
                                    ERROR: Script timed out.

                                     

                                    Thanks

                                    Rakib

                                    1 2 Previous Next