1 Reply Latest reply on Jun 19, 2017 6:02 PM by John.Khamissi-Oracle

    can't make install Compress-Zlib-2.009

    1707257

      Hi all,

         when install and confirure Oracle E-Business Suite Integrated SOA Gateway - Version 12.1.3.

         It show some error. and i found solution is Doc ID 1079218.1.

         when i apply 13602850,can't make install Compress-Zlib-2.009.

       

         Error message,

       

      [root@usertest Compress-Zlib-2.009]# perl Makefile.PL

      Up/Downgrade not needed.

      Warning: prerequisite IO::Compress::Base 2.009 not found.

      Warning: prerequisite IO::Compress::Base::Common 2.009 not found.

      Warning: prerequisite IO::Compress::Gzip 2.009 not found.

      Warning: prerequisite IO::Uncompress::Base 2.009 not found.

      Warning: prerequisite IO::Uncompress::Gunzip 2.009 not found.

      Writing Makefile for Compress::Zlib

      [root@usertest Compress-Zlib-2.009]#

       

      [root@usertest Compress-Zlib-2.009]# perl Makefile.PL

      Up/Downgrade not needed.

      Warning: prerequisite IO::Compress::Base 2.009 not found.

      Warning: prerequisite IO::Compress::Base::Common 2.009 not found.

      Warning: prerequisite IO::Compress::Gzip 2.009 not found.

      Warning: prerequisite IO::Uncompress::Base 2.009 not found.

      Warning: prerequisite IO::Uncompress::Gunzip 2.009 not found.

      Writing Makefile for Compress::Zlib

      [root@usertest Compress-Zlib-2.009]#

      [root@usertest Compress-Zlib-2.009]#

      [root@usertest Compress-Zlib-2.009]#

      [root@usertest Compress-Zlib-2.009]# make test

      PERL_DL_NONLAZY=1 /usr/bin/perl "-MExtUtils::Command::MM" "-e" "test_harness(0, 'blib/lib', 'blib/arch')" t/*.t

      t/000prereq.....NOK 2                                                       

      #     Failed test (t/000prereq.t at line 46)

      #     Tried to use 'IO::Compress::Base'.

      #     Error:  Can't locate IO/Compress/Base.pm in @INC (@INC contains: t t/compress /backup/patch/patch_ws/Compress/Compress-Zlib-2.009/blib/lib /backup/patch/patch_ws/Compress/Compress-Zlib-2.009/blib/arch /usr/lib64/perl5/site_perl/5.8.8/x86_64-linux-thread-multi /usr/lib/perl5/site_perl/5.8.8 /usr/lib/perl5/site_perl /usr/lib64/perl5/vendor_perl/5.8.8/x86_64-linux-thread-multi /usr/lib/perl5/vendor_perl/5.8.8 /usr/lib/perl5/vendor_perl /usr/lib64/perl5/5.8.8/x86_64-linux-thread-multi /usr/lib/perl5/5.8.8 .) at (eval 5) line 2.

      # BEGIN failed--compilation aborted at t/000prereq.t line 46.

      t/000prereq.....NOK 3                                                       

      #     Failed test (t/000prereq.t at line 46)

      #     Tried to use 'IO::Compress::Gzip'.

      #     Error:  Can't locate IO/Compress/Base.pm in @INC (@INC contains: t t/compress /backup/patch/patch_ws/Compress/Compress-Zlib-2.009/blib/lib /backup/patch/patch_ws/Compress/Compress-Zlib-2.009/blib/arch /usr/lib64/perl5/site_perl/5.8.8/x86_64-linux-thread-multi /usr/lib/perl5/site_perl/5.8.8 /usr/lib/perl5/site_perl /usr/lib64/perl5/vendor_perl/5.8.8/x86_64-linux-thread-multi /usr/lib/perl5/vendor_perl/5.8.8 /usr/lib/perl5/vendor_perl /usr/lib64/perl5/5.8.8/x86_64-linux-thread-multi /usr/lib/perl5/5.8.8 .) at /usr/lib/perl5/site_perl/5.8.8/IO/Compress/RawDeflate.pm line 10.

      # BEGIN failed--compilation aborted at t/000prereq.t line 46.

      # Compilation failed in require at /usr/lib/perl5/site_perl/5.8.8/IO/Compress/Gzip.pm line 11.

      # BEGIN failed--compilation aborted at /usr/lib/perl5/site_perl/5.8.8/IO/Compress/Gzip.pm line 11.

      # Compilation failed in require at (eval 6) line 2.

      # BEGIN failed--compilation aborted at (eval 6) line 2.

      t/000prereq.....NOK 4                                                       

      #     Failed test (t/000prereq.t at line 46)

      #     Tried to use 'IO::Uncompress::Gunzip'.

      #     Error:  Can't locate IO/Compress/Base/Common.pm in @INC (@INC contains: t t/compress /backup/patch/patch_ws/Compress/Compress-Zlib-2.009/blib/lib /backup/patch/patch_ws/Compress/Compress-Zlib-2.009/blib/arch /usr/lib64/perl5/site_perl/5.8.8/x86_64-linux-thread-multi /usr/lib/perl5/site_perl/5.8.8 /usr/lib/perl5/site_perl /usr/lib64/perl5/vendor_perl/5.8.8/x86_64-linux-thread-multi /usr/lib/perl5/vendor_perl/5.8.8 /usr/lib/perl5/vendor_perl /usr/lib64/perl5/5.8.8/x86_64-linux-thread-multi /usr/lib/perl5/5.8.8 .) at /usr/lib/perl5/site_perl/5.8.8/IO/Uncompress/RawInflate.pm line 9.

      # BEGIN failed--compilation aborted at t/000prereq.t line 46.

      # Compilation failed in require at /usr/lib/perl5/site_perl/5.8.8/IO/Uncompress/Gunzip.pm line 12.

      # BEGIN failed--compilation aborted at /usr/lib/perl5/site_perl/5.8.8/IO/Uncompress/Gunzip.pm line 12.

      # Compilation failed in require at (eval 7) line 2.

      # BEGIN failed--compilation aborted at (eval 7) line 2.

      # Looks like you failed 3 tests of 6.

      t/000prereq.....dubious                                                     

              Test returned status 3 (wstat 768, 0x300)

      DIED. FAILED tests 2-4

              Failed 3/6 tests, 50.00% okay

      t/01version.....NOK 1                                                       

      #     Failed test (t/01version.t at line 23)

      #     Tried to use 'Compress::Zlib'.

      #     Error:  Can't locate IO/Compress/Base/Common.pm in @INC (@INC contains: t t/compress /backup/patch/patch_ws/Compress/Compress-Zlib-2.009/blib/lib /backup/patch/patch_ws/Compress/Compress-Zlib-2.009/blib/arch /usr/lib64/perl5/site_perl/5.8.8/x86_64-linux-thread-multi /usr/lib/perl5/site_perl/5.8.8 /usr/lib/perl5/site_perl /usr/lib64/perl5/vendor_perl/5.8.8/x86_64-linux-thread-multi /usr/lib/perl5/vendor_perl/5.8.8 /usr/lib/perl5/vendor_perl /usr/lib64/perl5/5.8.8/x86_64-linux-thread-multi /usr/lib/perl5/5.8.8 .) at /backup/patch/patch_ws/Compress/Compress-Zlib-2.009/blib/lib/Compress/Zlib.pm line 11.

      # BEGIN failed--compilation aborted at t/01version.t line 23.

      # Compilation failed in require at (eval 3) line 2.

      # BEGIN failed--compilation aborted at (eval 3) line 2.

      Bareword "ZLIB_VERSION" not allowed while "strict subs" in use at t/01version.t line 28.

      Bareword "Compress::Zlib::zlib_version" not allowed while "strict subs" in use at t/01version.t line 29.

      Execution of t/01version.t aborted due to compilation errors.

      # Looks like you planned 2 tests but only ran 1.

      # Looks like your test died just after 1.

      t/01version.....dubious                                                     

              Test returned status 255 (wstat 65280, 0xff00)

      DIED. FAILED tests 1-2

              Failed 2/2 tests, 0.00% okay

      t/03zlib-v1.....NOK 1                                                       

      #     Failed test (t/03zlib-v1.t at line 35)

      #     Tried to use 'Compress::Zlib'.

      #     Error:  Can't locate IO/Compress/Base/Common.pm in @INC (@INC contains: t t/compress /backup/patch/patch_ws/Compress/Compress-Zlib-2.009/blib/lib /backup/patch/patch_ws/Compress/Compress-Zlib-2.009/blib/arch /usr/lib64/perl5/site_perl/5.8.8/x86_64-linux-thread-multi /usr/lib/perl5/site_perl/5.8.8 /usr/lib/perl5/site_perl /usr/lib64/perl5/vendor_perl/5.8.8/x86_64-linux-thread-multi /usr/lib/perl5/vendor_perl/5.8.8 /usr/lib/perl5/vendor_perl /usr/lib64/perl5/5.8.8/x86_64-linux-thread-multi /usr/lib/perl5/5.8.8 .) at /backup/patch/patch_ws/Compress/Compress-Zlib-2.009/blib/lib/Compress/Zlib.pm line 11.

      # BEGIN failed--compilation aborted at t/03zlib-v1.t line 35.

      # Compilation failed in require at (eval 4) line 2.

      # BEGIN failed--compilation aborted at (eval 4) line 2.

      t/03zlib-v1.....NOK 3                                                       

      #     Failed test (t/03zlib-v1.t at line 38)

      #     Tried to use 'IO::Compress::Gzip'.

      #     Error:  Can't locate IO/Compress/Base.pm in @INC (@INC contains: t t/compress /backup/patch/patch_ws/Compress/Compress-Zlib-2.009/blib/lib /backup/patch/patch_ws/Compress/Compress-Zlib-2.009/blib/arch /usr/lib64/perl5/site_perl/5.8.8/x86_64-linux-thread-multi /usr/lib/perl5/site_perl/5.8.8 /usr/lib/perl5/site_perl /usr/lib64/perl5/vendor_perl/5.8.8/x86_64-linux-thread-multi /usr/lib/perl5/vendor_perl/5.8.8 /usr/lib/perl5/vendor_perl /usr/lib64/perl5/5.8.8/x86_64-linux-thread-multi /usr/lib/perl5/5.8.8 .) at /usr/lib/perl5/site_perl/5.8.8/IO/Compress/RawDeflate.pm line 10.

      # BEGIN failed--compilation aborted at t/03zlib-v1.t line 38.

      # Compilation failed in require at /usr/lib/perl5/site_perl/5.8.8/IO/Compress/Gzip.pm line 11.

      # BEGIN failed--compilation aborted at /usr/lib/perl5/site_perl/5.8.8/IO/Compress/Gzip.pm line 11.

      # Compilation failed in require at (eval 9) line 2.

      # BEGIN failed--compilation aborted at (eval 9) line 2.

      Global symbol "$gzerrno" requires explicit package name at t/03zlib-v1.t line 1050.

      Bareword "Compress::Zlib::zlib_version" not allowed while "strict subs" in use at t/03zlib-v1.t line 50.

      Bareword "ZLIB_VERSION" not allowed while "strict subs" in use at t/03zlib-v1.t line 50.

      Bareword "Z_BEST_COMPRESSION" not allowed while "strict subs" in use at t/03zlib-v1.t line 126.

      Bareword "Z_OK" not allowed while "strict subs" in use at t/03zlib-v1.t line 147.

      Bareword "Z_OK" not allowed while "strict subs" in use at t/03zlib-v1.t line 153.

      Bareword "Z_OK" not allowed while "strict subs" in use at t/03zlib-v1.t line 158.

      Bareword "Z_OK" not allowed while "strict subs" in use at t/03zlib-v1.t line 160.

      Bareword "Z_OK" not allowed while "strict subs" in use at t/03zlib-v1.t line 169.

      Bareword "Z_STREAM_END" not allowed while "strict subs" in use at t/03zlib-v1.t line 177.

      Bareword "Z_OK" not allowed while "strict subs" in use at t/03zlib-v1.t line 177.

      Bareword "Z_STREAM_END" not allowed while "strict subs" in use at t/03zlib-v1.t line 181.

      Bareword "Z_OK" not allowed while "strict subs" in use at t/03zlib-v1.t line 192.

      Bareword "Z_OK" not allowed while "strict subs" in use at t/03zlib-v1.t line 204.

      Bareword "Z_OK" not allowed while "strict subs" in use at t/03zlib-v1.t line 206.

      Bareword "Z_OK" not allowed while "strict subs" in use at t/03zlib-v1.t line 218.

      Bareword "Z_STREAM_END" not allowed while "strict subs" in use at t/03zlib-v1.t line 229.

      Bareword "Z_OK" not allowed while "strict subs" in use at t/03zlib-v1.t line 229.

      Bareword "Z_STREAM_END" not allowed while "strict subs" in use at t/03zlib-v1.t line 233.

      Bareword "Z_OK" not allowed while "strict subs" in use at t/03zlib-v1.t line 248.

      Bareword "Z_OK" not allowed while "strict subs" in use at t/03zlib-v1.t line 253.

      Bareword "Z_STREAM_END" not allowed while "strict subs" in use at t/03zlib-v1.t line 262.

      Bareword "Z_BEST_COMPRESSION" not allowed while "strict subs" in use at t/03zlib-v1.t line 269.

      Bareword "Z_OK" not allowed while "strict subs" in use at t/03zlib-v1.t line 275.

      Bareword "Z_OK" not allowed while "strict subs" in use at t/03zlib-v1.t line 277.

      Bareword "Z_STREAM_END" not allowed while "strict subs" in use at t/03zlib-v1.t line 284.

      Bareword "Z_BEST_COMPRESSION" not allowed while "strict subs" in use at t/03zlib-v1.t line 307.

      Bareword "Z_OK" not allowed while "strict subs" in use at t/03zlib-v1.t line 310.

      Bareword "Z_OK" not allowed while "strict subs" in use at t/03zlib-v1.t line 312.

      Bareword "Z_OK" not allowed while "strict subs" in use at t/03zlib-v1.t line 321.

      Bareword "Z_STREAM_END" not allowed while "strict subs" in use at t/03zlib-v1.t line 327.

      Bareword "Z_OK" not allowed while "strict subs" in use at t/03zlib-v1.t line 554.

      Bareword "Z_OK" not allowed while "strict subs" in use at t/03zlib-v1.t line 560.

      Bareword "Z_OK" not allowed while "strict subs" in use at t/03zlib-v1.t line 565.

      Bareword "Z_OK" not allowed while "strict subs" in use at t/03zlib-v1.t line 567.

      Bareword "Z_OK" not allowed while "strict subs" in use at t/03zlib-v1.t line 578.

      Bareword "Z_STREAM_END" not allowed while "strict subs" in use at t/03zlib-v1.t line 585.

      Bareword "Z_OK" not allowed while "strict subs" in use at t/03zlib-v1.t line 585.

      Bareword "Z_STREAM_END" not allowed while "strict subs" in use at t/03zlib-v1.t line 589.

      Bareword "Z_OK" not allowed while "strict subs" in use at t/03zlib-v1.t line 605.

      Bareword "Z_OK" not allowed while "strict subs" in use at t/03zlib-v1.t line 608.

      Bareword "Z_FULL_FLUSH" not allowed while "strict subs" in use at t/03zlib-v1.t line 611.

      Bareword "Z_OK" not allowed while "strict subs" in use at t/03zlib-v1.t line 611.

      Bareword "Z_OK" not allowed while "strict subs" in use at t/03zlib-v1.t line 615.

      Bareword "Z_OK" not allowed while "strict subs" in use at t/03zlib-v1.t line 618.

      Bareword "Z_OK" not allowed while "strict subs" in use at t/03zlib-v1.t line 626.

      Bareword "Z_OK" not allowed while "strict subs" in use at t/03zlib-v1.t line 629.

      Bareword "Z_DATA_ERROR" not allowed while "strict subs" in use at t/03zlib-v1.t line 636.

      Bareword "Z_OK" not allowed while "strict subs" in use at t/03zlib-v1.t line 640.

      Bareword "Z_STREAM_END" not allowed while "strict subs" in use at t/03zlib-v1.t line 650.

      Bareword "Z_OK" not allowed while "strict subs" in use at t/03zlib-v1.t line 650.

      Bareword "Z_DATA_ERROR" not allowed while "strict subs" in use at t/03zlib-v1.t line 655.

      Bareword "Z_STREAM_END" not allowed while "strict subs" in use at t/03zlib-v1.t line 655.

      Bareword "Z_OK" not allowed while "strict subs" in use at t/03zlib-v1.t line 666.

      Bareword "Z_OK" not allowed while "strict subs" in use at t/03zlib-v1.t line 669.

      Bareword "Z_OK" not allowed while "strict subs" in use at t/03zlib-v1.t line 672.

      Bareword "Z_DATA_ERROR" not allowed while "strict subs" in use at t/03zlib-v1.t line 676.

      Bareword "Z_BEST_COMPRESSION" not allowed while "strict subs" in use at t/03zlib-v1.t line 687.

      Bareword "Z_DEFAULT_STRATEGY" not allowed while "strict subs" in use at t/03zlib-v1.t line 687.

      Bareword "Z_OK" not allowed while "strict subs" in use at t/03zlib-v1.t line 690.

      Bareword "Z_BEST_COMPRESSION" not allowed while "strict subs" in use at t/03zlib-v1.t line 692.

      Bareword "Z_DEFAULT_STRATEGY" not allowed while "strict subs" in use at t/03zlib-v1.t line 693.

      Bareword "Z_OK" not allowed while "strict subs" in use at t/03zlib-v1.t line 696.

      Bareword "Z_BEST_COMPRESSION" not allowed while "strict subs" in use at t/03zlib-v1.t line 710.

      Bareword "Z_DEFAULT_STRATEGY" not allowed while "strict subs" in use at t/03zlib-v1.t line 711.

      Bareword "Z_BEST_SPEED" not allowed while "strict subs" in use at t/03zlib-v1.t line 714.

      Bareword "Z_HUFFMAN_ONLY" not allowed while "strict subs" in use at t/03zlib-v1.t line 714.

      Bareword "Z_OK" not allowed while "strict subs" in use at t/03zlib-v1.t line 715.

      Bareword "Z_BEST_SPEED" not allowed while "strict subs" in use at t/03zlib-v1.t line 717.

      Bareword "Z_HUFFMAN_ONLY" not allowed while "strict subs" in use at t/03zlib-v1.t line 718.

      Bareword "Z_OK" not allowed while "strict subs" in use at t/03zlib-v1.t line 721.

      Bareword "Z_NO_COMPRESSION" not allowed while "strict subs" in use at t/03zlib-v1.t line 726.

      Bareword "Z_OK" not allowed while "strict subs" in use at t/03zlib-v1.t line 727.

      Bareword "Z_NO_COMPRESSION" not allowed while "strict subs" in use at t/03zlib-v1.t line 729.

      Bareword "Z_HUFFMAN_ONLY" not allowed while "strict subs" in use at t/03zlib-v1.t line 730.

      Bareword "Z_OK" not allowed while "strict subs" in use at t/03zlib-v1.t line 733.

      Bareword "Z_FILTERED" not allowed while "strict subs" in use at t/03zlib-v1.t line 738.

      Bareword "Z_OK" not allowed while "strict subs" in use at t/03zlib-v1.t line 739.

      Bareword "Z_NO_COMPRESSION" not allowed while "strict subs" in use at t/03zlib-v1.t line 741.

      Bareword "Z_FILTERED" not allowed while "strict subs" in use at t/03zlib-v1.t line 742.

      Bareword "Z_OK" not allowed while "strict subs" in use at t/03zlib-v1.t line 745.

      Bareword "Z_OK" not allowed while "strict subs" in use at t/03zlib-v1.t line 749.

      Bareword "Z_OK" not allowed while "strict subs" in use at t/03zlib-v1.t line 757.

      Bareword "Z_STREAM_END" not allowed while "strict subs" in use at t/03zlib-v1.t line 761.

      Bareword "Z_OK" not allowed while "strict subs" in use at t/03zlib-v1.t line 817.

      Bareword "Z_OK" not allowed while "strict subs" in use at t/03zlib-v1.t line 823.

      Bareword "Z_STREAM_END" not allowed while "strict subs" in use at t/03zlib-v1.t line 834.

      Bareword "Z_STREAM_ERROR" not allowed while "strict subs" in use at t/03zlib-v1.t line 1185.

      Execution of t/03zlib-v1.t aborted due to compilation errors.

      # Looks like you planned 401 tests but only ran 3.

      # Looks like your test died just after 3.

      t/03zlib-v1.....dubious                                                     

              Test returned status 255 (wstat 65280, 0xff00)

      DIED. FAILED tests 1, 3-401

              Failed 400/401 tests, 0.25% okay

      t/05examples....Can't locate IO/Compress/Base/Common.pm in @INC (@INC contains: t t/compress /backup/patch/patch_ws/Compress/Compress-Zlib-2.009/blib/lib /backup/patch/patch_ws/Compress/Compress-Zlib-2.009/blib/arch /usr/lib64/perl5/site_perl/5.8.8/x86_64-linux-thread-multi /usr/lib/perl5/site_perl/5.8.8 /usr/lib/perl5/site_perl /usr/lib64/perl5/vendor_perl/5.8.8/x86_64-linux-thread-multi /usr/lib/perl5/vendor_perl/5.8.8 /usr/lib/perl5/vendor_perl /usr/lib64/perl5/5.8.8/x86_64-linux-thread-multi /usr/lib/perl5/5.8.8 .) at /backup/patch/patch_ws/Compress/Compress-Zlib-2.009/blib/lib/Compress/Zlib.pm line 11.

      BEGIN failed--compilation aborted at /backup/patch/patch_ws/Compress/Compress-Zlib-2.009/blib/lib/Compress/Zlib.pm line 11.

      Compilation failed in require at t/05examples.t line 16.

      BEGIN failed--compilation aborted at t/05examples.t line 16.

      # Looks like your test died before it could output anything.

      t/05examples....dubious                                                     

              Test returned status 255 (wstat 65280, 0xff00)

      t/06gzsetp......Can't locate IO/Compress/Base/Common.pm in @INC (@INC contains: t t/compress /backup/patch/patch_ws/Compress/Compress-Zlib-2.009/blib/lib /backup/patch/patch_ws/Compress/Compress-Zlib-2.009/blib/arch /usr/lib64/perl5/site_perl/5.8.8/x86_64-linux-thread-multi /usr/lib/perl5/site_perl/5.8.8 /usr/lib/perl5/site_perl /usr/lib64/perl5/vendor_perl/5.8.8/x86_64-linux-thread-multi /usr/lib/perl5/vendor_perl/5.8.8 /usr/lib/perl5/vendor_perl /usr/lib64/perl5/5.8.8/x86_64-linux-thread-multi /usr/lib/perl5/5.8.8 .) at /backup/patch/patch_ws/Compress/Compress-Zlib-2.009/blib/lib/Compress/Zlib.pm line 11.

      BEGIN failed--compilation aborted at /backup/patch/patch_ws/Compress/Compress-Zlib-2.009/blib/lib/Compress/Zlib.pm line 11.

      Compilation failed in require at t/06gzsetp.t line 16.

      BEGIN failed--compilation aborted at t/06gzsetp.t line 16.

      # Looks like your test died before it could output anything.

      t/06gzsetp......dubious                                                     

              Test returned status 255 (wstat 65280, 0xff00)

      t/08encoding....NOK 1                                                       

      #     Failed test (t/08encoding.t at line 33)

      #     Tried to use 'Compress::Zlib'.

      #     Error:  Can't locate IO/Compress/Base/Common.pm in @INC (@INC contains: t t/compress /backup/patch/patch_ws/Compress/Compress-Zlib-2.009/blib/lib /backup/patch/patch_ws/Compress/Compress-Zlib-2.009/blib/arch /usr/lib64/perl5/site_perl/5.8.8/x86_64-linux-thread-multi /usr/lib/perl5/site_perl/5.8.8 /usr/lib/perl5/site_perl /usr/lib64/perl5/vendor_perl/5.8.8/x86_64-linux-thread-multi /usr/lib/perl5/vendor_perl/5.8.8 /usr/lib/perl5/vendor_perl /usr/lib64/perl5/5.8.8/x86_64-linux-thread-multi /usr/lib/perl5/5.8.8 .) at /backup/patch/patch_ws/Compress/Compress-Zlib-2.009/blib/lib/Compress/Zlib.pm line 11.

      # BEGIN failed--compilation aborted at t/08encoding.t line 33.

      # Compilation failed in require at (eval 4) line 2.

      # BEGIN failed--compilation aborted at (eval 4) line 2.

      Bareword "Compress::Zlib::zlib_version" not allowed while "strict subs" in use at t/08encoding.t line 40.

      Bareword "ZLIB_VERSION" not allowed while "strict subs" in use at t/08encoding.t line 40.

      Execution of t/08encoding.t aborted due to compilation errors.

      # Looks like you planned 29 tests but only ran 1.

      # Looks like your test died just after 1.

      t/08encoding....dubious                                                     

              Test returned status 255 (wstat 65280, 0xff00)

      DIED. FAILED tests 1-29

              Failed 29/29 tests, 0.00% okay

      t/14gzopen......NOK 1                                                       

      #     Failed test (t/14gzopen.t at line 25)

      #     Tried to use 'Compress::Zlib'.

      #     Error:  Can't locate IO/Compress/Base/Common.pm in @INC (@INC contains: t t/compress /backup/patch/patch_ws/Compress/Compress-Zlib-2.009/blib/lib /backup/patch/patch_ws/Compress/Compress-Zlib-2.009/blib/arch /usr/lib64/perl5/site_perl/5.8.8/x86_64-linux-thread-multi /usr/lib/perl5/site_perl/5.8.8 /usr/lib/perl5/site_perl /usr/lib64/perl5/vendor_perl/5.8.8/x86_64-linux-thread-multi /usr/lib/perl5/vendor_perl/5.8.8 /usr/lib/perl5/vendor_perl /usr/lib64/perl5/5.8.8/x86_64-linux-thread-multi /usr/lib/perl5/5.8.8 .) at /backup/patch/patch_ws/Compress/Compress-Zlib-2.009/blib/lib/Compress/Zlib.pm line 11.

      # BEGIN failed--compilation aborted at t/14gzopen.t line 25.

      # Compilation failed in require at (eval 7) line 2.

      # BEGIN failed--compilation aborted at (eval 7) line 2.

      t/14gzopen......ok 2/250Global symbol "$gzerrno" requires explicit package name at t/14gzopen.t line 49.

      Global symbol "$gzerrno" requires explicit package name at t/14gzopen.t line 53.

      Global symbol "$gzerrno" requires explicit package name at t/14gzopen.t line 56.

      Global symbol "$gzerrno" requires explicit package name at t/14gzopen.t line 59.

      Global symbol "$gzerrno" requires explicit package name at t/14gzopen.t line 66.

      Global symbol "$gzerrno" requires explicit package name at t/14gzopen.t line 94.

      Global symbol "$gzerrno" requires explicit package name at t/14gzopen.t line 97.

      Global symbol "$gzerrno" requires explicit package name at t/14gzopen.t line 100.

      Global symbol "$gzerrno" requires explicit package name at t/14gzopen.t line 104.

      Global symbol "$gzerrno" requires explicit package name at t/14gzopen.t line 111.

      Global symbol "$gzerrno" requires explicit package name at t/14gzopen.t line 111.

      Global symbol "$gzerrno" requires explicit package name at t/14gzopen.t line 117.

      Global symbol "$gzerrno" requires explicit package name at t/14gzopen.t line 118.

      Global symbol "$gzerrno" requires explicit package name at t/14gzopen.t line 480.

      Global symbol "$gzerrno" requires explicit package name at t/14gzopen.t line 481.

      Global symbol "$gzerrno" requires explicit package name at t/14gzopen.t line 499.

      Global symbol "$gzerrno" requires explicit package name at t/14gzopen.t line 502.

      Bareword "Compress::Zlib::zlib_version" not allowed while "strict subs" in use at t/14gzopen.t line 38.

      Bareword "ZLIB_VERSION" not allowed while "strict subs" in use at t/14gzopen.t line 38.

      Bareword "Z_FINISH" not allowed while "strict subs" in use at t/14gzopen.t line 98.

      Bareword "Z_STREAM_END" not allowed while "strict subs" in use at t/14gzopen.t line 110.

      Bareword "Z_STREAM_END" not allowed while "strict subs" in use at t/14gzopen.t line 111.

      Bareword "Z_STREAM_ERROR" not allowed while "strict subs" in use at t/14gzopen.t line 446.

      Bareword "Z_STREAM_ERROR" not allowed while "strict subs" in use at t/14gzopen.t line 461.

      Execution of t/14gzopen.t aborted due to compilation errors.

      # Looks like you planned 250 tests but only ran 2.

      # Looks like your test died just after 2.

      t/14gzopen......dubious                                                     

              Test returned status 255 (wstat 65280, 0xff00)

      DIED. FAILED tests 1, 3-250

              Failed 249/250 tests, 0.40% okay

      t/99pod.........skipped

              all skipped: Test::Pod 1.00 required for testing POD

      Failed Test    Stat Wstat Total Fail  Failed  List of Failed

      -------------------------------------------------------------------------------

      t/000prereq.t     3   768     6    3  50.00%  2-4

      t/01version.t   255 65280     2    3 150.00%  1-2

      t/03zlib-v1.t   255 65280   401  798 199.00%  1 3-401

      t/05examples.t  255 65280    ??   ??       %  ??

      t/06gzsetp.t    255 65280    ??   ??       %  ??

      t/08encoding.t  255 65280    29   57 196.55%  1-29

      t/14gzopen.t    255 65280   250  497 198.80%  1 3-250

      1 test skipped.

      Failed 7/8 test scripts, 12.50% okay. 683/688 subtests failed, 0.73% okay.

      make: *** [test_dynamic] Error 255

      [root@usertest Compress-Zlib-2.009]#

       

      [root@usertest Compress-Zlib-2.009]# make install UNINST=1

      Manifying blib/man3/Compress::Zlib.3pm

      Writing /usr/lib64/perl5/site_perl/5.8.8/x86_64-linux-thread-multi/auto/Compress/Zlib/.packlist

      Appending installation info to /usr/lib64/perl5/5.8.8/x86_64-linux-thread-multi/perllocal.pod

       

      [root@usertest Compress-Zlib-2.009]# make install

      Writing /usr/lib64/perl5/site_perl/5.8.8/x86_64-linux-thread-multi/auto/Compress/Zlib/.packlist

      Appending installation info to /usr/lib64/perl5/5.8.8/x86_64-linux-thread-multi/perllocal.pod

      [root@usertest Compress-Zlib-2.009]#

       

      [root@usertest Compress-Zlib-2.009]# perl -V

      Summary of my perl5 (revision 5 version 8 subversion 8) configuration:

       

      [root@usertest Compress-Zlib-2.009]# cat /etc/issue

      Red Hat Enterprise Linux Server release 5.8 (Tikanga)

       

      John.Khamissi-Oracle

        • 1. Re: can't make install Compress-Zlib-2.009
          John.Khamissi-Oracle

          Hello,

           

          This error tells me some pre-req may be missing:

           

          ++

          [root@usertest Compress-Zlib-2.009]# perl Makefile.PL

          Up/Downgrade not needed.

          Warning: prerequisite IO::Compress::Base 2.009 not found.

          Warning: prerequisite IO::Compress::Base::Common 2.009 not found.

          Warning: prerequisite IO::Compress::Gzip 2.009 not found.

          Warning: prerequisite IO::Uncompress::Base 2.009 not found.

          Warning: prerequisite IO::Uncompress::Gunzip 2.009 not found.
          ++

           

          I downloaded patch 13602850 and reviewed the README file. Found the following:

           

          ++

          View ISG Implementation Guide, Chapter "Administering Custom Integration Interfaces and Services", Section "Setting Up and Using the Integration Repository Parser" for details to install this patch.
          ++

           

          Did you follow the requirements as outlined ?

           

          I may have to conduct some more research on this issue.

           

          John Khamissi
          Oracle Support Services