You're almost there! Please answer a few more questions for access to the Applications content. Complete registration
Interested in joining? Complete your registration by providing Areas of Interest here. Register

Failing to import Sanpshot in Test POD

Received Response
11
Views
2
Comments
edited Aug 17, 2021 11:16AM in Financial Consolidation and Close 2 comments

Summary

Failing to import Sanpshot in Test POD

Content

Hi All,

I followed the steps below to migrate my production snapshot to my test environment:

1) Copied the snapshot via epmautomate to the test pod

2) Removed the existing application

3) Run the recreate command in epmautomate

4) Imported the snapshot from the web UI.

I receive the error below which I believe is causing my data not to tie.

/Cube/Consol/Standard Dimensions/Product :- Load failed for the following reason - Of 98 records, 40 failed: *Record 21* failed as Error because com.hyperion.planning.InvalidMemberException: The member TMRPR does not exist for the specified cube or you do not have access to it. *Record 22* failed as Error because com.hyperion.planning.InvalidMemberException: The member PROLA does not exist for the specified cube or you do not have access to it. *Record 23* failed as Error because com.hyperion.planning.InvalidMemberException: The member PROLA does not exist for the specified cube or you do not have access to it. *Record 24* failed as Error because com.hyperion.planning.InvalidMemberException: The member TMRPR

Howdy, Stranger!

Log In

To view full details, sign in.

Register

Don't have an account? Click here to get started!